{"text_format":"1","workbook":"xlsx","n_sheets":21,"sheets":["Liet. instrukcija","SĀKUMS","Gāzbetona bl.","Keramzītbetona bl.","Inertie mat.","Jumta seg.","Zāģmateriāli","Lokšņmateriāli","Siltumizolācija","Transportbetons","Sheet1","Stiegrojums","Ķieģeļi","Ruļmateriāli","Hidroizolācijas mat.","Sausie m.","Būvkalumi","Terauda","Starpt","Makross","Koptāme"],"not_rendered":{"charts":0,"images":4,"macros":1,"external_links":0,"defined_names":3,"comments":0,"pivot_tables":0},"unopened":[],"bounds":{"document_bytes":16777216,"sheet_cells":100000,"rows_first":2000,"rows_last":500,"rows_between":2000,"halvings":0,"cell_chars":16384,"cell_head_chars":4096},"cells_cut":0,"cells_raw":0,"read":"whole","date_system":"1900"}

{"sheet":"Liet. instrukcija","index":0,"n_rows":60,"n_cols":4,"rows_kept":60,"cut":false,"hidden":false,"merged":[[43,2,43,8],[45,0,45,8],[56,2,56,8],[59,0,59,8],[0,0,0,8],[2,0,2,8],[18,3,18,8],[20,0,20,8],[33,3,33,8],[34,0,34,8],[58,0,58,8]]}
["Būvmateriālu kataloga lietošanas instrukcija"]
[]
["1. Navigācijai starp izklājlapām izmantojiet saites, kas atrodas 1.1. tabulā. Nospiežot uz kādu no izvēlētās pozīcijas automātiski tiks atvērta izvēlētā izklājlapa. Skatīt attēlu 1.1.;"]
[]
[]
[]
[]
[]
[]
[]
[]
[]
[]
[]
[]
[]
[]
[]
[null,null,null,"1.1. attēls"]
[]
["2. Nonākot izvēlētajā būvmateriālu pozīcijas izklājlapā tiek piedāvātas iespējas ievadīt attiecīgā būvizstrādājuma daudzumu (kolonna E) atbilstoši mērvienībam, kā arī rediģēt būvizstrādājuma cenu (kolonna D) un izveidot piezīmes (kolonna G). Skatīt attēlu 1.2.;"]
[]
[]
[]
[]
[]
[]
[]
[]
[]
[]
[]
[]
[null,null,null,"1.2. attēls"]
["3. Atgriezties izklājlapā \"SĀKUMS\" iespējams izmantojot katras izklājlapas peigās pogu \"SĀKUMS\". Skatīt attēlu 1.3.;"]
[]
[]
[]
[]
[]
[]
[]
[]
[null,null,"1.3. attēls"]
[]
["4. Pēc attiecīgo būvizstrādājumu pozīciju daudzuma ievades pa izklājlapām iespējams apskatīt kopsavilkumu izklājlapā \"KOPTĀME\". Vispirms nospiežot pogu \"ATJAUNINĀT TĀMI\". Skatīt attēlu 1.4.;"]
[]
[]
[]
[]
[]
[]
[]
[]
[]
[]
[null,null,"1.4. attēls"]
[]
["SVARĪGI: Pēc izmaiņu veikšanas būvmaterialu pozīciju izklājlapās jāveic koptāmes atjaunināšana nospiežot pogu \"ATJAUNINĀT TĀMI\" izklājlapā \"KOPTĀME\""]
["Katalogā esošā informācija atjaunota 28.03.2018."]

{"sheet":"SĀKUMS","index":1,"n_rows":21,"n_cols":5,"rows_kept":21,"cut":false,"hidden":false,"merged":[[14,2,14,6],[15,2,15,6],[16,2,16,6],[17,2,17,16383],[21,2,21,6],[18,2,18,16383],[19,2,19,16383],[13,2,13,6],[1,0,1,6],[3,4,3,6],[4,2,4,6],[5,2,5,6],[6,2,6,6],[7,2,7,6],[8,2,8,6],[9,2,9,6],[10,2,10,6],[11,2,11,6],[12,2,12,6]]}
[]
["Būvmateriālu katalogā ietvertās būvmateriālu pozīcijas"]
[]
[null,null,null,null,"1.1. tabula"]
["Nr.p.k.","Lapas nosaukums","Piezīmes"]
[1,2,3]
[1]
[2]
[3]
[4]
[5]
[6]
[7]
[8]
[9]
[10]
[11]
[12]
[13]
[14]
[15,"Tērauda izstrādājumi"]

{"sheet":"Gāzbetona bl.","index":2,"n_rows":49,"n_cols":9,"rows_kept":49,"cut":false,"hidden":false,"merged":[[45,1,45,8],[47,2,47,8],[48,2,48,8],[46,2,46,8]]}
["Nr.p.k.","Nosaukums","Mērvienība",2017,"Cena par mērvienību (EUR)",2020,"Ievadiet daudzumu","Cena par daudzumu (EUR)","Piezīmes"]
[1,2,3,null,4,4,5,6,7]
[1,"bauroc Eco Term Plus 500 ","m³",68.849999999999994,69.322079940776987,{"$f":"D3*0.96906318","v":66.719999942999991},null,{"$f":"IF(ISNUMBER(G3),E3*G3,\"\")","v":""}]
[2,"bauroc Eco Term Plus 375 ","m³",68.849999999999994,69.322079940776987,66.719999942999991,null,{"$f":"IF(ISNUMBER(G4),E4*G4,\"\")","v":""}]
[3,"bauroc Eco Term Plus 300 ","m³",68.849999999999994,69.322079940776987,66.719999942999991,null,""]
[4,"bauroc EcoLight 375","m³",59.65,60.058998815793004,57.804618687000001,null,""]
[5,"bauroc EcoLight 250","m³",59.65,60.058998815793004,57.804618687000001,null,""]
[6,"bauroc EcoLight 200","m³",59.65,60.058998815793004,57.804618687000001,null,""]
[7,"bauroc Universal 300 ","m³",53.95,54.319915944879007,52.280958561000006,null,""]
[8,"bauroc Universal 200","m³",53.95,54.319915944879007,52.280958561000006,null,""]
[9,"bauroc Classic 300","m³",68.760000000000005,69.231462842815205,66.632784256800008,null,""]
[10,"bauroc Classic 250","m³",68.760000000000005,69.231462842815205,66.632784256800008,null,""]
[11,"bauroc Classic 200","m³",68.760000000000005,69.231462842815205,66.632784256800008,null,""]
[12,"bauroc Classic 150","m³",68.760000000000005,69.231462842815205,66.632784256800008,null,""]
[13,"bauroc Classic 100","m³",68.760000000000005,69.231462842815205,66.632784256800008,null,""]
[14,"bauroc Acoustic 250","m³",69.819999999999993,70.298730885476388,67.659991227599988,null,""]
[15,"bauroc Acoustic 150","m³",69.819999999999993,70.298730885476388,67.659991227599988,null,""]
[16,"bauroc Acoustic 100","m³",69.819999999999993,70.298730885476388,67.659991227599988,null,""]
[17,"bauroc Hard 300","m³",71.86,72.352718439277211,69.636880114800007,null,""]
[18,"bauroc Hard 250","m³",71.86,72.352718439277211,69.636880114800007,null,""]
[19,"bauroc Hard 200","m³",71.86,72.352718439277211,69.636880114800007,null,""]
[20,"TexoBLOCK GRAND 400","m³",60.09,60.502015739161806,58.231006486200002,null,""]
[21,"TexoBLOCK GRAND 375","m³",60.09,60.502015739161806,58.231006486200002,null,""]
[22,"TexoBLOCK CLASSIC 300","m³",60.38,60.794004165927603,58.512034808400003,null,""]
[23,"TexoBLOCK CLASSIC 240","m³",60.38,60.794004165927603,58.512034808400003,null,""]
[24,"TexoBLOCK STANDART 300","m³",58.1,58.498371017562,56.302570758000002,null,""]
[25,"TexoBLOCK STANDART 200","m³",58.1,58.498371017562,56.302570758000002,null,""]
[26,"TexoBLOCK SCREEN 150","m³",64.8,65.244310532496002,62.795294063999997,null,""]
[27,"TexoBLOCK SCREEN 120","m³",64.8,65.244310532496002,62.795294063999997,null,""]
[28,"TexoBLOCK SCREEN 100","m³",64.8,65.244310532496002,62.795294063999997,null,""]
[29,"RocLITE ENERGO TERM 500","m³",50.06,50.4032435996412,48.511302790800002,null,""]
[30,"RocLITE ENERGO 380","m³",50.06,50.4032435996412,48.511302790800002,null,""]
[31,"RocLITE CLASSIC","m³",50.07,50.413312166081397,48.5209934226,null,""]
[32,"RocLITE STANDART","m³",46.74,47.0604795414948,45.294013033200002,null,""]
[33,"RocLITE UNIVERSAL","m³",46.74,47.0604795414948,45.294013033200002,null,""]
[34,"RocLITE PARTITION","m³",56.63,57.018291750852597,54.878047883400001,null,""]
[35,"BLOCK 200/250 PPL2/04/25","m³",41.59,41.875167824791809,40.303337656200007,null,""]
[36,"BLOCK 250/200 PPL2/04/25","m³",41.59,41.875167824791809,40.303337656200007,null,""]
[37,"Ytong Energo PP2/0,35 S+GT","m³",63.59,64.0260139932318,61.622727616200002,null,""]
[38,"Ytong PP2/0,4 S+GT","m³",74.16,74.6684887205232,71.865725428800005,null,""]
[39,"Ytong PP3/0,5 S+GT","m³",130.24,131.13300931716481,126.21078856320001,null,""]
[40,"Ytong PP4/0,6 S+GT","m³",90.06,90.677509360441206,87.27382999080001,null,""]
[41,"Ytong PP2/0,4 S","m³",81.36,81.917856557467189,78.842980324799996,null,""]
[42,"Ytong Interior PP3/0,5 S","m³",70.28,70.761884941725597,68.105760290399999,null,""]
[43,"Ytong PP4/0,6 ","m³",71.73,72.2218270755546,69.510901901400004,null,""]
[]
[null,"Piezīmes:","1. Saraksta secībai nav nekāda sakara ar būvmateriālu vai būvizstrādājumu kvalitātes rādītājiem vai izmantošanas iespējamību. Saraksts izveidots nejaušā secībā;"]
[null,null,"3. Būvmateriālu vai būvizstrādājumu patiesās cenas var mainīties atkarībā no to piegādātāja vai tirgotāja piedāvājuma izmaiņām;"]
[null,null,"3 Katalogā redzamās būvmateriālu vai būvizstrādājumu cenas ir vidējās Latvijas mazumtirzniecības cenas bez PVN (21%);"]

{"sheet":"Keramzītbetona bl.","index":3,"n_rows":41,"n_cols":9,"rows_kept":41,"cut":false,"hidden":false,"merged":[[38,2,38,8],[39,2,39,8],[40,2,40,8],[41,2,41,8],[39,1,40,1]]}
["Nr.p.k.","Nosaukums","Mērvienība",2017,"Cena par mērvienību (EUR)",2018,"Ievadiet daudzumu","Cena par daudzumu (EUR)","Piezīmes"]
[1,2,3,null,4,4,5,6,7]
[1,"FIBO Term 420","m³",227.95,234.46602679879297,{"$f":"D3*0.9899762595","v":225.665088353025},null,{"$f":"IF(ISNUMBER(G3),G3*E3,\"\")","v":""}]
[2,"FIBO Term 380","m³",223.05,229.42595866405253,{"$f":"D4*0.9899762595","v":220.81420468147502},null,{"$f":"IF(ISNUMBER(G4),G4*E4,\"\")","v":""}]
[4,"FIBO Term 300","m³",219.58,225.8567675563894,217.37898706101001,null,""]
[5,"FIBO standarta bloki 5 Mpa 300","m³",82.26,84.611429543622336,81.435447106470008,null,""]
[6,"FIBO standarta bloki 5 Mpa 250","m³",82.26,84.611429543622336,81.435447106470008,null,""]
[7,"FIBO standarta bloki 5 Mpa 200","m³",82.26,84.611429543622336,81.435447106470008,null,""]
[8,"FIBO standarta bloki 5 Mpa 150","m³",82.26,84.611429543622336,81.435447106470008,null,""]
[9,"FIBO standarta bloki 5 Mpa 100","m³",82.26,84.611429543622336,81.435447106470008,null,""]
[10,"FIBO standarta bloki 3 Mpa 350","m³",75.819999999999993,77.987339995106311,75.059999995289999,null,""]
[11,"FIBO standarta bloki 3 Mpa 300","m³",75.819999999999993,77.987339995106311,75.059999995289999,null,""]
[12,"FIBO standarta bloki 3 Mpa 250","m³",75.819999999999993,77.987339995106311,75.059999995289999,null,""]
[13,"FIBO standarta bloki 3 Mpa 200","m³",75.819999999999993,77.987339995106311,75.059999995289999,null,""]
[14,"FIBO standarta bloki 3 Mpa 150","m³",75.819999999999993,77.987339995106311,75.059999995289999,null,""]
[15,"FIBO standarta bloki 3 Mpa 100","m³",75.819999999999993,77.987339995106311,75.059999995289999,null,""]
[16,"FIBO PLUS 300","m³",72.34,74.407863034106981,71.614882612230005,null,""]
[17,"FIBO PLUS 250","m³",72.34,74.407863034106981,71.614882612230005,null,""]
[18,"FIBO PLUS 200","m³",72.34,74.407863034106981,71.614882612230005,null,""]
[19,"BBR Keramzīta bloki 3 Mpa 300","m³",75.78,77.946196581761498,75.020400944910008,null,""]
[20,"BBR Keramzīta bloki 3 Mpa 250","m³",75.78,77.946196581761498,75.020400944910008,null,""]
[21,"BBR Keramzīta bloki 3 Mpa 200","m³",75.78,77.946196581761498,75.020400944910008,null,""]
[22,"BBR Keramzīta bloki 3 Mpa 150","m³",75.78,77.946196581761498,75.020400944910008,null,""]
[23,"BBR Keramzīta bloki 3 Mpa 100","m³",75.78,77.946196581761498,75.020400944910008,null,""]
[24,"BBR Keramzīta bloki 5 Mpa 300","m³",77.989999999999995,80.219370169062785,77.208248478404997,null,""]
[25,"BBR Keramzīta bloki 5 Mpa 250","m³",77.989999999999995,80.219370169062785,77.208248478404997,null,""]
[26,"BBR Keramzīta bloki 5 Mpa 200","m³",77.989999999999995,80.219370169062785,77.208248478404997,null,""]
[27,"Kolle Keramzīta bloki 3 Mpa 300","m³",74.150000000000006,76.269602487960071,73.406739641925,null,""]
[28,"Kolle Keramzīta bloki 3 Mpa 250","m³",74.150000000000006,76.269602487960071,73.406739641925,null,""]
[29,"Kolle Keramzīta bloki 3 Mpa 200","m³",74.150000000000006,76.269602487960071,73.406739641925,null,""]
[30,"Kolle Keramzīta bloki 3 Mpa 150","m³",74.150000000000006,76.269602487960071,73.406739641925,null,""]
[31,"Kolle Keramzīta bloki 3 Mpa 100","m³",74.150000000000006,76.269602487960071,73.406739641925,null,""]
[32,"Kolle Keramzīta bloki 5 Mpa 300","m³",76.59,78.779350701994105,75.822281715105007,null,""]
[33,"Kolle Keramzīta bloki 5 Mpa 250","m³",76.59,78.779350701994105,75.822281715105007,null,""]
[34,"Kolle Keramzīta bloki 5 Mpa 200","m³",76.59,78.779350701994105,75.822281715105007,null,""]
[35,"Kolle Keramzīta bloki 5 Mpa 150","m³",76.59,78.779350701994105,75.822281715105007,null,""]
[36,"Kolle Keramzīta bloki 5 Mpa 100","m³",76.59,78.779350701994105,75.822281715105007,null,""]
[]
[null,"Piezīmes:","1. Saraksta secībai nav nekāda sakara ar būvmateriālu vai būvizstrādājumu kvalitātes rādītājiem vai izmantošanas iespējamību. Saraksts izveidots nejaušā secībā;"]
[null,null,"3. Būvmateriālu vai būvizstrādājumu patiesās cenas var mainīties atkarībā no to piegādātāja vai tirgotāja piedāvājuma izmaiņām;"]
[null,null,"3 Katalogā redzamās būvmateriālu vai būvizstrādājumu cenas ir vidējās Latvijas mazumtirzniecības cenas bez PVN (21%);"]

{"sheet":"Inertie mat.","index":4,"n_rows":39,"n_cols":7,"rows_kept":39,"cut":false,"hidden":false,"merged":[[35,2,35,6],[36,2,36,6],[37,2,37,6],[38,2,38,6],[2,0,2,1],[12,0,12,1],[12,2,12,6],[23,0,23,1],[23,2,23,6],[2,2,2,6],[36,1,37,1]]}
["Nr.p.k.","Nosaukums","Mērvienība","Cena par mērvienību (EUR)","Ievadiet daudzumu","Cena par daudzumu (EUR)","Piezīmes"]
[1,2,3,4,5,6,7]
["Dabisks materiāls"]
[1,"Dabīgā grants 0+ mm","t",3.78,null,{"$f":"IF(ISNUMBER(E4),E4*D4,\"\")","v":""}]
[2,"Dabīgā smilts","t",2.64,null,{"$f":"IF(ISNUMBER(E5),E5*D5,\"\")","v":""}]
[3,"Grants ceļu būvei ar mālu (sijāta) 0-40 mm","t",null,null,""]
[4,"Betonēšanas grants 0+ mm","t",null,null,""]
[5,"Betonēšanas grants dabīgā (sijāta) 0-40 mm","t",null,null,""]
[6,"Akmens +40 mm","t",null,null,""]
[7,"Atsijas 0-8 mm","t",null,null,""]
[8,"Atsijas 0-4 mm","t",3.7,null,""]
[9,"Uzberamā smilts 0-4 mm","t",null,null,""]
["Drupināts materiāls"]
[9,"Granīta šķembas 0-5 mm","t",16.420000000000002,null,""]
[10,"Granīta šķembas 0-45 mm","t",16.420000000000002,null,""]
[11,"Granīta šķembas 5-8 mm","t",20.85,null,""]
[12,"Granīta šķembas 8-11 mm","t",20.85,null,""]
[13,"Granīta šķembas 11-16 mm","t",20.85,null,""]
[14,"Dolomīta šķembas 2-8 mm","t",5.91,null,""]
[15,"Dolomīta šķembas 8-16 mm","t",5.45,null,""]
[16,"Dolomīta šķembas 16-32 mm","t",8.83,null,""]
[17,"Dolomīta šķembas 20-40 mm","t",5.22,null,""]
[18,"Dolomīta šķembas 40-70 mm","t",4.68,null,""]
["Mazgāts materiāls"]
[19,"Mazgāta smilts 0-2 mm","t",5.2,null,""]
[20,"Mazgāta smilts 0-4 mm","t",5.71,null,""]
[21,"Mazgāti oļi 2-6 mm","t",16.420000000000002,null,""]
[22,"Mazgāti oļi 4-8 mm","t",16.420000000000002,null,""]
[23,"Mazgāti oļi 6-12 mm","t",16.420000000000002,null,""]
[24,"Mazgāti oļi 8-16 mm","t",16.420000000000002,null,""]
[25,"Mazgāti oļi 16-32 mm","t",16.420000000000002,null,""]
[26,"Mazgātas dolomīta šķembas 5-8 mm","t",12.99,null,""]
[27,"Mazgātas dolomīta šķembas 8-16 mm","t",11.43,null,""]
[28,"Mazgātas dolomīta šķembas 16-32 mm","t",10.39,null,""]
[]
[null,"Piezīmes:","1. Saraksta secībai nav nekāda sakara ar būvmateriālu vai būvizstrādājumu kvalitātes rādītājiem vai izmantošanas iespējamību. Saraksts izveidots nejaušā secībā;"]
[null,null,"3. Būvmateriālu vai būvizstrādājumu patiesās cenas var mainīties atkarībā no to piegādātāja vai tirgotāja piedāvājuma izmaiņām;"]
[null,null,"3 Katalogā redzamās būvmateriālu vai būvizstrādājumu cenas ir vidējās Latvijas mazumtirzniecības cenas bez PVN (21%);"]
[null,null,"4 Būvmateriālu vai būvizstrādājumu cenas ir norādītas bez PVN (21%), kā arī mazumtirzniecībā;"]

{"sheet":"Jumta seg.","index":5,"n_rows":62,"n_cols":9,"rows_kept":62,"cut":false,"hidden":false,"merged":[[2,0,2,1],[19,0,19,1],[28,0,28,1],[36,0,36,1],[7,2,7,8],[19,2,19,8],[28,2,28,8],[36,2,36,8],[2,2,2,8],[7,0,7,1],[59,2,59,8],[60,2,60,8],[61,2,61,8],[59,1,60,1],[43,0,43,1],[48,0,48,1],[43,2,43,8],[48,2,48,8],[58,2,58,8]]}
["Nr.p.k.","Nosaukums","Mērvienība",2017,"Cena par mērvienību (EUR)",null,"Ievadiet daudzumu","Cena par daudzumu (EUR)","Piezīmes"]
[1,2,3,null,4,null,5,6,7]
["Viļņotās bitumena loksnes"]
[1,"Ondura viļņotās jumta loksnes 2000x1000 mm","m²",3.44,3.5612335624871601,{"$f":"D4*0.9963833635","v":3.4275587704400001},null,{"$f":"IF(ISNUMBER(G4),G4*E4,\"\")","v":""}]
[2,"Guttanit K-11 bitumena loksne 2000x830 mm","m²",3.59,3.716519909688635,{"$f":"D5*0.9963833635","v":3.5770162749650001},null,{"$f":"IF(ISNUMBER(G5),G5*E5,\"\")","v":""}]
[3,"Onduline PP viļņotās jumta loksnes 2000x950 mm","m²",3.4,3.5198238699000997,3.3877034358999998,null,""]
[4,"Caurspīdīgās PVC jumta loksnes 2000x950 mm","m²",5.99,6.2011014649122354,5.9683363473650006,null,""]
["Bitumena šindeļi"]
[5,"Iko ArmourShield","m²",6.04,5.5146577633399998,{"$f":"D9*0.8787515","v":5.3076590599999998},null,""]
[6,"Iko Cambridge","m²",8.33,7.605479994805,{"$f":"D10*0.8787515","v":7.3199999949999999},null,""]
[7,"Iko Marathon","m²",6.6,6.0259505360999999,5.7997598999999997,null,""]
[8,"Technonikol Akords Džaivs","m²",4.54,4.1451235505900001,3.9895318099999999,null,""]
[9,"Technonikol Akords Prāga","m²",4.32,3.9442585327200006,3.7962064800000004,null,""]
[10,"Technonikol Hexagonal","m²",3.66,3.3416634791100002,3.2162304900000001,null,""]
[11,"Technonikol Sonata Kadriļa","m²",3.96,3.6155703216600004,3.4798559400000002,null,""]
[12,"Technonikol Sonata Samba","m²",4.4400000000000004,4.0538212697400002,3.9016566600000004,null,""]
[13,"Technonikol Sonata Versalles","m²",4.25,3.880346936125,3.7346938750000001,null,""]
[14,"Technonikol Tango super","m²",4.67,4.2638165156949999,4.1037695049999998,null,""]
[15,"Technonikol Trio super","m²",4.55,4.1542537786749998,3.9983193249999998,null,""]
["Bezazbesta šīferis"]
[16,"Eco Dach L 1130x1750 mm","m²",4.83,3.852196399904412,{"$f":"D21*0.7676190476","v":3.707599999908},null,""]
[17,"Eco dach M 1130x1000 mm","m²",5.32,4.2429989332280478,{"$f":"D22*0.7676190476","v":4.0837333332319998},null,""]
[18,"Eternit Baltijas vilnis 920x875 mm","m²",5.96,4.7534348951201437,4.575009523696,null,""]
[19,"Eternit Gotika 920x585 mm","m²",6.08,4.8491416379749124,4.6671238094080003,null,""]
[20,"Eternit Klasika L 1130x1750 mm","m²",5.29,4.2190722475143554,4.0607047618039998,null,""]
[21,"Eternit Klasika M 1130x1250 mm","m²",5.25,4.1871699998961001,4.0299999999000002,null,""]
[22,"Eternit Klasika XL 1130x2500 mm","m²",5.26,4.1951455618006639,4.0376761903759997,null,""]
[23,"Caurspīdīgās PVC jumta loksnes","m²",8.61,6.8669587998296029,6.6091999998359992,null,""]
["Profilētāis skārds"]
[24,"Ruukki Monterrey","m²",6.4,7.7197699999999996,{"$f":"D30*1.1609375","v":7.43},null,""]
[25,"Ruukki Adamante","m²",10.66,12.858241906250001,{"$f":"D31*1.1609375","v":12.37559375},null,""]
[26,"Ruukki Classic","m²",8.16,9.8427067499999996,9.4732500000000002,null,""]
[27,"Ruukki Decorrey","m²",6.02,7.2614086562499995,6.9888437499999991,null,""]
[28,"Ruukki T20","m²",5.53,6.6703637656249999,6.4199843750000003,null,""]
[29,"Ruukki T45","m²",7.29,8.793300515624999,8.463234374999999,null,""]
[30,"Ruukki Valcprofils","m²",10.16,12.255134875000001,11.795125000000001,null,""]
["Uzkausējamais ruļļmateriāls"]
[31,"Ruberoīds","m²",0.76,0.78678415915414002,0.75725135626000006,null,""]
[32,"Technonicol Ecofleks V 3.0kg HPP","m²",1.26,1.3044053164923901,1.2554430380100001,null,""]
[33,"Technonicol Bikroelast ","m²",1.71,1.7702643580968149,1.703815551585,null,""]
[34,"Technonicol Bipol standart","m²",2.09,2.1636564376738847,2.0824412297149997,null,""]
[35,"Technonicol Unifleks","m²",2.99,3.0953745208827352,2.9791862568650003,null,""]
[36,"Technonicol Tehnoelast","m²",3.71,3.8407489874498153,3.6965822785850002,null,""]
["Betona dakstiņi"]
[37,"Monier Minster TE","m²",16.28,16.85374488293342,16.221121157780001,null,""]
[38,"Monier Zanda Lux","m²",6.68,6.915418662039019,6.6558408681799994,null,""]
[39,"Monier Zanda Polar","m²",9.3699999999999992,9.7002204885188039,9.3361121159949985,null,""]
[40,"Monier Zanda Protector","m²",8.35,8.6442733275487758,8.3198010852250004,null,""]
["Māla dakstiņi"]
[41,"Monier Dantegl","m²",12.53,12.841399502896545,{"$f":"D50*0.9863833635","v":12.359383544655},null,""]
[42,"Monier Granat 13V","m²",16.89,17.309755594886084,{"$f":"D51*0.9863833635","v":16.660015009515},null,""]
[43,"Monier Nortegl","m²",21.95,22.495508307149173,21.651114828824998,null,""]
[44,"Monier Nova","m²",14.34,14.696382192461011,14.14473743259,null,""]
[45,"Monier Rubin 13V","m²",17.100000000000001,17.524974580968152,16.867155515850001,null,""]
[46,"Monier Turmalin","m²",18.62,19.082750099276431,18.36645822837,null,""]
[47,"Monier Vittinge E13","m²",12.85,13.169352243593025,12.675026220974999,null,""]
[48,"Monier Vittinge T11","m²",10.39,10.648215549488835,10.248523146765001,null,""]
[]
[null,"Piezīmes:","1. Saraksta secībai nav nekāda sakara ar būvmateriālu vai būvizstrādājumu kvalitātes rādītājiem vai izmantošanas iespējamību. Saraksts izveidots nejaušā secībā;"]
[null,null,"3. Būvmateriālu vai būvizstrādājumu patiesās cenas var mainīties atkarībā no to piegādātāja vai tirgotāja piedāvājuma izmaiņām;"]
[null,null,"3 Katalogā redzamās būvmateriālu vai būvizstrādājumu cenas ir vidējās Latvijas mazumtirzniecības cenas bez PVN (21%);"]
[null,null,"4 Būvmateriālu vai būvizstrādājumu cenas ir norādītas bez PVN (21%), kā arī mazumtirzniecībā;"]

{"sheet":"Zāģmateriāli","index":6,"n_rows":57,"n_cols":7,"rows_kept":57,"cut":false,"hidden":false,"merged":[[2,0,2,1],[2,2,2,6],[37,0,37,1],[37,2,37,6],[53,2,53,6],[54,2,54,6],[55,2,55,6],[56,2,56,6],[50,0,50,1],[50,2,50,16383],[54,1,55,1]]}
["Nr.p.k.","Nosaukums","Mērvienība","Cena par mērvienību (EUR)","Ievadiet daudzumu","Cena par daudzumu (EUR)","Piezīmes"]
[1,2,3,4,5,6,7]
["Svaiģi zāģēts kokmateriāls"]
[1,"25x50 mm","m³",148.30000000000001,null,{"$f":"IF(ISNUMBER(E4),E4*D4,\"\")","v":""}]
[2,"25x75 mm","m³",148.30000000000001,null,{"$f":"IF(ISNUMBER(E5),E5*D5,\"\")","v":""}]
[3,"25x100 mm","m³",148.30000000000001,null,""]
[4,"25x125 mm","m³",148.30000000000001,null,""]
[5,"25x150 mm","m³",148.30000000000001,null,""]
[6,"32x100 mm","m³",148.30000000000001,null,""]
[7,"50x50 mm","m³",148.30000000000001,null,""]
[8,"50x75 mm","m³",148.30000000000001,null,""]
[9,"50x100 mm","m³",148.30000000000001,null,""]
[10,"50x125 mm","m³",148.30000000000001,null,""]
[11,"50x150 mm","m³",148.30000000000001,null,""]
[12,"50x175 mm","m³",148.30000000000001,null,""]
[13,"50x200 mm","m³",148.30000000000001,null,""]
[14,"50x225 mm","m³",148.30000000000001,null,""]
[15,"50x250 mm","m³",148.30000000000001,null,""]
[16,"75x75 mm","m³",148.30000000000001,null,""]
[17,"75x100 mm","m³",148.30000000000001,null,""]
[18,"75x150 mm","m³",148.30000000000001,null,""]
[19,"75x200 mm","m³",148.30000000000001,null,""]
[20,"75x225 mm","m³",148.30000000000001,null,""]
[21,"75x250 mm","m³",148.30000000000001,null,""]
[22,"100x100 mm","m³",148.30000000000001,null,""]
[23,"100x150 mm","m³",148.30000000000001,null,""]
[24,"100x200 mm","m³",148.30000000000001,null,""]
[25,"100x225 mm","m³",148.30000000000001,null,""]
[26,"100x250 mm","m³",148.30000000000001,null,""]
[27,"125x125 mm","m³",148.30000000000001,null,""]
[28,"150x150 mm","m³",148.30000000000001,null,""]
[29,"150x200 mm","m³",148.30000000000001,null,""]
[30,"150x225 mm","m³",148.30000000000001,null,""]
[31,"150x250 mm","m³",148.30000000000001,null,""]
[32,"200x200 mm","m³",148.30000000000001,null,""]
[33,"200x250 mm","m³",148.30000000000001,null,""]
[34,"250x250 mm","m³",148.30000000000001,null,""]
["Kaltēts-kalibrēts zāģmateriāls"]
[35,"20x95 mm","m³",296.12,null,""]
[36,"20x120 mm","m³",296.12,null,""]
[37,"20x145 mm","m³",296.12,null,""]
[38,"45x45 mm","m³",296.12,null,""]
[39,"45x70 mm","m³",296.12,null,""]
[40,"45x95 mm","m³",296.12,null,""]
[41,"45x120 mm","m³",296.12,null,""]
[42,"45x145 mm","m³",296.12,null,""]
[43,"45x195 mm","m³",296.12,null,""]
[44,"45x220 mm","m³",296.12,null,""]
[45,"45x245 mm","m³",296.12,null,""]
[46,"95x95 mm","m³",296.12,null,""]
["Zāgmateriālu impregnēšana"]
[47,"Visi šķērsgriezumi","m³",19.29,null,""]
[]
[null,"Piezīmes:","1. Saraksta secībai nav nekāda sakara ar būvmateriālu vai būvizstrādājumu kvalitātes rādītājiem vai izmantošanas iespējamību. Saraksts izveidots nejaušā secībā;"]
[null,null,"3. Būvmateriālu vai būvizstrādājumu patiesās cenas var mainīties atkarībā no to piegādātāja vai tirgotāja piedāvājuma izmaiņām;"]
[null,null,"3 Katalogā redzamās būvmateriālu vai būvizstrādājumu cenas ir vidējās Latvijas mazumtirzniecības cenas bez PVN (21%);"]
[null,null,"4 Būvmateriālu vai būvizstrādājumu cenas ir norādītas bez PVN (21%), kā arī mazumtirzniecībā;"]

{"sheet":"Lokšņmateriāli","index":7,"n_rows":71,"n_cols":9,"rows_kept":71,"cut":false,"hidden":false,"merged":[[68,1,69,1],[69,2,69,8],[70,2,70,8],[2,2,2,8],[22,2,22,8],[55,2,55,8],[53,2,53,8],[2,0,2,1],[16,0,16,1],[22,0,22,1],[67,2,67,8],[68,2,68,8],[55,0,55,1],[30,0,30,1],[37,0,37,1],[16,2,16,8],[53,0,53,1],[42,0,42,1],[49,0,49,1],[30,2,30,8],[37,2,37,8],[49,2,49,8],[42,2,42,8]]}
["Nr.p.k.","Nosaukums","Mērvienība",2017,"Cena par mērvienību (EUR)",2018,"Ievadiet daudzumu","Cena par daudzumu (EUR)","Piezīmes"]
[1,2,3,null,4,4,5,6,7]
["OSB plāksnes"]
[1,"OSB 3, 6 mm","m²",2.2400000000000002,2.5600960000000006,{"$f":"D4*1.1","v":2.4640000000000004},null,{"$f":"IF(ISNUMBER(G4),E4*G4,\"\")","v":""}]
[2,"OSB 3 , 8 mm","m²",2.2000000000000002,2.5143800000000005,{"$f":"D5*1.1","v":2.4200000000000004},null,{"$f":"IF(ISNUMBER(G5),E5*G5,\"\")","v":""}]
[3,"OSB 3, 9 mm","m²",2.0499999999999998,2.3429449999999998,2.2549999999999999,null,""]
[4,"OSB 3, 10 mm","m²",2.2400000000000002,2.5600960000000006,2.4640000000000004,null,""]
[5,"OSB 3, 12 mm","m²",2.6,2.9715400000000005,2.8600000000000003,null,""]
[6,"OSB 3, 15 mm","m²",3.26,3.725854,3.5859999999999999,null,""]
[7,"OSB 3, 18 mm","m²",3.92,4.4801679999999999,4.3120000000000003,null,""]
[8,"OSB 3, 20 mm","m²",4.38,5.0059020000000007,4.8180000000000005,null,""]
[9,"OSB 3, 22 mm","m²",4.75,5.4287750000000008,5.2250000000000005,null,""]
[10,"OSB 3 T&G4, 12 mm","m²",3.17,3.6229930000000001,3.4870000000000001,null,""]
[11,"OSB 3 T&G4, 15 mm","m²",3.79,4.3315910000000004,4.1690000000000005,null,""]
[12,"OSB 3 T&G4, 18 mm","m²",4.55,5.2001949999999999,5.0049999999999999,null,""]
[13,"OSB 3 T&G4, 22 mm","m²",5.56,6.3545239999999996,6.1159999999999997,null,""]
["Kokskaidu plāksnes"]
[14,"12 mm","m²",2.4500000000000002,2.8001050000000003,{"$f":"D18*1.1","v":2.6950000000000003},null,""]
[15,"16 mm","m²",3.08,3.5201320000000003,{"$f":"D19*1.1","v":3.3880000000000003},null,""]
[16,"18 mm","m²",3.47,3.9658630000000006,3.8170000000000006,null,""]
[17,"22 mm","m²",4.41,5.0401890000000007,4.8510000000000009,null,""]
[18,"T&G4, 22 mm","m²",5.13,5.8630770000000005,5.6430000000000007,null,""]
["Bērza saplāksnis"]
[19,"4 mm","m²",4.93,5.6344969999999996,{"$f":"D24*1.1","v":5.423},null,""]
[20,"6,5 mm","m²",5.05,5.7716450000000004,{"$f":"D25*1.1","v":5.5550000000000006},null,""]
[21,"9 mm","m²",6,6.8574000000000002,6.6000000000000005,null,""]
[22,"12 mm","m²",6.95,7.9431550000000009,7.6450000000000005,null,""]
[23,"15 mm","m²",8.43,9.6346469999999993,9.2729999999999997,null,""]
[24,"18 mm","m²",9.85,11.257565000000001,10.835000000000001,null,""]
[25,"21 mm","m²",11.8,13.486220000000003,12.980000000000002,null,""]
["Egles saplāksnis"]
[26,"9 mm","m²",4.41,5.0401890000000007,{"$f":"D32*1.1","v":4.8510000000000009},null,""]
[27,"12 mm","m²",5.35,6.1145149999999999,{"$f":"D33*1.1","v":5.8849999999999998},null,""]
[28,"15 mm","m²",6.42,7.3374180000000004,7.0620000000000003,null,""]
[29,"18 mm","m²",7.58,8.6631820000000008,8.338000000000001,null,""]
[30,"21 mm","m²",8.99,10.274671000000001,9.8890000000000011,null,""]
[31,"24 mm","m²",10.74,12.274746000000002,11.814000000000002,null,""]
["Laminēts bērza saplāksnis FF"]
[32,"12 mm","m²",8.76,10.011804000000001,{"$f":"D39*1.1","v":9.636000000000001},null,""]
[33,"15 mm","m²",10.59,12.103311000000001,{"$f":"D40*1.1","v":11.649000000000001},null,""]
[34,"18 mm","m²",11.94,13.646226,13.134,null,""]
[35,"21 mm","m²",13.95,15.943455,15.345000000000001,null,""]
["Laminēts bērza saplāksnis FW"]
[36,"6,5 mm","m²",7.87,8.9946230000000007,{"$f":"D44*1.1","v":8.657},null,""]
[37,"9 mm","m²",8.42,9.6232180000000014,{"$f":"D45*1.1","v":9.2620000000000005},null,""]
[38,"12 mm","m²",10.15,11.600435000000001,11.165000000000001,null,""]
[39,"15 mm","m²",11.67,13.337643000000002,12.837000000000002,null,""]
[40,"18 mm","m²",13.1,14.97199,14.41,null,""]
[41,"21 mm","m²",15.31,17.497799000000001,16.841000000000001,null,""]
["Laminēts egles saplāksnis FF"]
[42,"15 mm","m²",10.28,11.749012,{"$f":"D51*1.1","v":11.308},null,""]
[43,"18 mm","m²",11.66,13.326214,{"$f":"D52*1.1","v":12.826000000000001},null,""]
[44,"21 mm","m²",12.99,14.846271000000002,14.289000000000001,null,""]
["Preskartons"]
[45,"3,2 mm","m²",1,1.1429,{"$f":"D55*1.1","v":1.1000000000000001},null,""]
["Ģipškartons"]
[46,"Knauf WHITE (GKB)","m²",1.47,1.4753799930386999,{"$f":"D57*0.96598639","v":1.4199999933},null,""]
[47,"GREEN (GKBI)","m²",1.98,1.9872465212358001,{"$f":"D58*0.96598639","v":1.9126530522},null,""]
[48,"RED (GKF)","m²",2.1,2.1076857043409998,2.0285714189999999,null,""]
[49,"BLUE (GKFI)","m²",2.56,2.5693692395776,2.4729251583999998,null,""]
[50,"BROWN (GKB)","m²",2.31,2.3184542747751,2.2314285609,null,""]
[51,"NORGIPS Standart","m²",1.46,1.4653433944465999,1.4103401294,null,""]
[52,"NORGIPS Hard","m²",2.54,2.5492960423934004,2.4536054306000001,null,""]
[53,"NORGIPS Ugunsizturīgā plāksne","m²",1.79,1.7965511479859,1.7291156380999999,null,""]
[54,"NORGIPS Floor (grīdām)","m²",1.96,1.9671733240515998,1.8933333243999999,null,""]
[55,"NORGIPS Mitrumizturīgā plāksne","m²",1.68,1.6861485634727997,1.6228571351999999,null,""]
[]
[null,"Piezīmes:","1. Saraksta secībai nav nekāda sakara ar būvmateriālu vai būvizstrādājumu kvalitātes rādītājiem vai izmantošanas iespējamību. Saraksts izveidots nejaušā secībā;"]
[null,null,"3. Būvmateriālu vai būvizstrādājumu patiesās cenas var mainīties atkarībā no to piegādātāja vai tirgotāja piedāvājuma izmaiņām;"]
[null,null,"3 Katalogā redzamās būvmateriālu vai būvizstrādājumu cenas ir vidējās Latvijas mazumtirzniecības cenas bez PVN (21%);"]
[null,null,"4 Būvmateriālu vai būvizstrādājumu cenas ir norādītas bez PVN (21%), kā arī mazumtirzniecībā;"]

{"sheet":"Siltumizolācija","index":8,"n_rows":99,"n_cols":9,"rows_kept":99,"cut":false,"hidden":false,"merged":[[98,2,98,8],[92,0,92,1],[92,2,92,8],[34,2,34,8],[14,0,14,1],[95,2,95,8],[96,2,96,8],[97,2,97,8],[96,1,97,1],[2,0,2,1],[2,2,2,8],[45,0,45,1],[45,2,45,8],[86,0,86,1],[86,2,86,8],[56,0,56,1],[56,2,56,8],[67,0,67,1],[67,2,67,8],[73,0,73,1],[73,2,73,8],[14,2,14,8],[24,0,24,1],[24,2,24,8],[34,0,34,1]]}
["Nr.p.k.","Nosaukums","Mērvienība",2017,"Cena par mērvienību (EUR)",2018,"Ievadiet daudzumu","Cena par daudzumu (EUR)","Piezīmes"]
[1,2,3,null,4,null,5,6,7]
["Putu polistirols EPS 60"]
[1,"biezums 20 mm","m²",0.7,0.67275249999999998,{"$f":"D4*0.925","v":0.64749999999999996},null,{"$f":"IF(ISNUMBER(G4),G4*E4,\"\")","v":""}]
[2,"Biezums 30 mm","m²",1.05,1.0091287500000001,{"$f":"D5*0.925","v":0.97125000000000006},null,{"$f":"IF(ISNUMBER(G5),G5*E5,\"\")","v":""}]
[12,"biezums 40 mm","m²",null,0,0,null,""]
[3,"biezums 50 mm","m²",1.74,1.6722705000000002,1.6095000000000002,null,""]
[14,"biezums 60 mm","m²",null,0,0,null,""]
[4,"biezums 70 mm","m²",2.46,2.3642444999999999,2.2755000000000001,null,""]
[16,"biezums 80 mm","m²",null,0,0,null,""]
[17,"biezums 90 mm","m²",null,0,0,null,""]
[5,"biezums 100 mm","m²",3.48,3.3445410000000004,3.2190000000000003,null,""]
[6,"biezums 120 mm","m²",4.41,4.2383407499999999,4.07925,null,""]
[7,"biezums 150 mm","m²",5.51,5.2955232500000005,5.0967500000000001,null,""]
["Putu polistirols EPS 70"]
[8,"biezums 20 mm","m²",0.79,0.7592492500000001,{"$f":"D16*0.925","v":0.73075000000000012},null,{"$f":"IF(ISNUMBER(G16),G16*E16,\"\")","v":""}]
[9,"Biezums 30 mm","m²",1.19,1.1436792499999999,{"$f":"D17*0.925","v":1.1007499999999999},null,""]
[21,"biezums 40 mm","m²",null,0,0,null,""]
[10,"biezums 50 mm","m²",1.98,1.9029285000000002,1.8315000000000001,null,""]
[23,"biezums 60 mm","m²",null,0,0,null,""]
[24,"biezums 70 mm","m²",null,0,0,null,""]
[25,"biezums 80 mm","m²",null,0,0,null,""]
[26,"biezums 90 mm","m²",null,0,0,null,""]
[11,"biezums 100 mm","m²",3.94,3.7866355000000005,3.6445000000000003,null,""]
["Putu polistirols EPS 80"]
[12,"biezums 20 mm","m²",0.91,0.87457825000000011,{"$f":"D26*0.925","v":0.84175000000000011},null,{"$f":"IF(ISNUMBER(G26),G26*E26,\"\")","v":""}]
[13,"Biezums 30 mm","m²",1.37,1.3166727500000002,{"$f":"D27*0.925","v":1.2672500000000002},null,""]
[30,"biezums 40 mm","m²",null,0,0,null,""]
[14,"biezums 50 mm","m²",2.21,2.1239757500000001,2.0442499999999999,null,""]
[32,"biezums 60 mm","m²",null,0,0,null,""]
[33,"biezums 70 mm","m²",null,0,0,null,""]
[34,"biezums 80 mm","m²",null,0,0,null,""]
[35,"biezums 90 mm","m²",null,0,0,null,""]
[15,"biezums 100 mm","m²",4.42,4.2479515000000001,4.0884999999999998,null,""]
["Putu polistirols EPS 100"]
[16,"biezums 20 mm","m²",1.1399999999999999,1.0956254999999999,{"$f":"D36*0.925","v":1.0545},null,{"$f":"IF(ISNUMBER(G36),G36*E36,\"\")","v":""}]
[17,"Biezums 30 mm","m²",1.45,1.39355875,{"$f":"D37*0.925","v":1.3412500000000001},null,""]
[39,"biezums 40 mm","m²",null,0,0,null,""]
[18,"biezums 50 mm","m²",2.4,2.3065800000000003,2.2200000000000002,null,""]
[41,"biezums 60 mm","m²",null,0,0,null,""]
[42,"biezums 70 mm","m²",null,0,0,null,""]
[43,"biezums 80 mm","m²",null,0,0,null,""]
[44,"biezums 90 mm","m²",null,0,0,null,""]
[19,"biezums 70 mm","m²",3.61,3.4694807499999998,3.3392499999999998,null,""]
[20,"biezums 100 mm","m²",4.8,4.6131600000000006,4.4400000000000004,null,""]
["Putu polistirols EPS 120"]
[21,"biezums 30 mm","m²",2.56,2.4603520000000003,{"$f":"D47*0.925","v":2.3680000000000003},null,{"$f":"IF(ISNUMBER(G47),G47*E47,\"\")","v":""}]
[22,"biezums 50 mm","m²",3.87,3.7193602500000003,{"$f":"D48*0.925","v":3.5797500000000002},null,""]
[23,"biezums 75 mm","m²",5.81,5.5838457500000001,5.37425,null,""]
[50,"biezums 60 mm","m²",null,0,0,null,""]
[24,"biezums 100 mm","m²",7.73,7.4291097500000003,7.1502500000000007,null,""]
[25,"biezums 120 mm","m²",9.7200000000000006,9.3416490000000021,8.9910000000000014,null,""]
[52,"biezums 80 mm","m²",null,0,0,null,""]
[53,"biezums 90 mm","m²",null,0,0,null,""]
[26,"biezums 150 mm","m²",12.18,11.7058935,11.266500000000001,null,""]
[27,"biezums 200 mm","m²",16.27,15.636690249999999,15.04975,null,""]
["Putu polistirols EPS 150"]
[28,"biezums 20 mm","m²",2.29,2.2008617500000001,{"$f":"D58*0.925","v":2.1182500000000002},null,{"$f":"IF(ISNUMBER(G58),G58*E58,\"\")","v":""}]
[29,"Biezums 30 mm","m²",1.88,1.8068209999999998,{"$f":"D59*0.925","v":1.7389999999999999},null,""]
[57,"biezums 40 mm","m²",null,0,0,null,""]
[30,"biezums 50 mm","m²",3.14,3.0177754999999999,2.9045000000000001,null,""]
[59,"biezums 60 mm","m²",null,0,0,null,""]
[60,"biezums 70 mm","m²",null,0,0,null,""]
[61,"biezums 80 mm","m²",null,0,0,null,""]
[62,"biezums 90 mm","m²",null,0,0,null,""]
[31,"biezums 70 mm","m²",4.4800000000000004,4.3056160000000014,4.144000000000001,null,""]
[32,"biezums 100 mm","m²",6.29,6.0451617500000001,5.8182499999999999,null,""]
["Putu polistirols EPS 200"]
[33,"biezums 20 mm","m²",1.59,1.5281092500000002,{"$f":"D69*0.925","v":1.4707500000000002},null,{"$f":"IF(ISNUMBER(G69),G69*E69,\"\")","v":""}]
[34,"Biezums 30 mm","m²",2.38,2.2873584999999999,{"$f":"D70*0.925","v":2.2014999999999998},null,""]
[35,"biezums 50 mm","m²",3.97,3.8154677500000003,3.6722500000000005,null,""]
[36,"biezums 70 mm","m²",5.56,5.3435769999999998,5.1429999999999998,null,""]
[37,"biezums 100 mm","m²",7.93,7.6213247500000003,7.3352500000000003,null,""]
["Fasādes akmensvate"]
[38,"biezums 20 mm","m²",2.2999999999999998,2.3127311348666999,{"$f":"D75*0.967791411","v":2.2259202452999998},null,{"$f":"IF(ISNUMBER(G75),G75*E75,\"\")","v":""}]
[39,"Biezums 30 mm","m²",3.19,3.2076575305325097,{"$f":"D76*0.967791411","v":3.0872546010899997},null,""]
[40,"biezums 50 mm","m²",4.05,4.0724178679174496,3.9195552145499999,null,""]
[41,"biezums 80 mm","m²",5.35,5.3796137267551494,5.1776840488499998,null,""]
[42,"biezums 100 mm","m²",6.52,6.55608999970908,6.3099999997199996,null,""]
[43,"biezums 120 mm","m²",7.79,7.8331198002659104,7.5390950916900001,null,""]
[44,"biezums 140 mm","m²",9.7799999999999994,9.83413499956362,9.4649999995799998,null,""]
[45,"biezums 150 mm","m²",10.24,10.296681226536959,9.9101840486399997,null,""]
[46,"biezums 160 mm","m²",11.7,11.764762729539299,11.3231595087,null,""]
[47,"biezums 180 mm","m²",12.12,12.18708754547148,11.729631901319999,null,""]
[48,"biezums 200 mm","m²",12.84,12.911072944212359,12.426441717239999,null,""]
[49,"biezums 240 mm","m²",19.3,19.406830827359702,18.678374232300001,null,""]
["Minerālvate ruļļos"]
[50,"biezums 50 mm","m²",1.17,1.1764762729539298,{"$f":"D88*0.967791411","v":1.1323159508699998},null,{"$f":"IF(ISNUMBER(G88),G88*E88,\"\")","v":""}]
[51,"biezums 75 mm","m²",1.99,2.0010151992977101,{"$f":"D89*0.967791411","v":1.9259049078899999},null,""]
[52,"biezums 100 mm","m²",2.56,2.5741703066342398,2.4775460121599999,null,""]
[53,"biezums 125 mm","m²",3.78,3.8009233433896195,3.6582515335799997,null,""]
[54,"biezums 150 mm","m²",4.0199999999999996,4.0422518096365794,3.8905214722199997,null,""]
["Beramā siltumizolācija"]
[55,"Beramā akmenvate","m³",21.95,22.07149930883655,{"$f":"D94*0.967791411","v":21.24302147145},null,{"$f":"IF(ISNUMBER(G94),G94*E94,\"\")","v":""}]
[]
[null,"Piezīmes:","1. Saraksta secībai nav nekāda sakara ar būvmateriālu vai būvizstrādājumu kvalitātes rādītājiem vai izmantošanas iespējamību. Saraksts izveidots nejaušā secībā;"]
[null,null,"3. Būvmateriālu vai būvizstrādājumu patiesās cenas var mainīties atkarībā no to piegādātāja vai tirgotāja piedāvājuma izmaiņām;"]
[null,null,"3 Katalogā redzamās būvmateriālu vai būvizstrādājumu cenas ir vidējās Latvijas mazumtirzniecības cenas bez PVN (21%);"]
[null,null,"4 Būvmateriālu vai būvizstrādājumu cenas ir norādītas bez PVN (21%), kā arī mazumtirzniecībā;"]

{"sheet":"Transportbetons","index":9,"n_rows":35,"n_cols":9,"rows_kept":35,"cut":false,"hidden":false,"merged":[[32,2,32,8],[33,2,33,8],[34,2,34,8],[35,2,35,8],[2,0,2,1],[10,0,10,1],[28,0,28,1],[28,2,28,8],[18,2,18,8],[10,2,10,8],[2,2,2,8],[18,0,18,1],[33,1,34,1]]}
["Nr.p.k.","Nosaukums","Mērvienība",2017,"Cena par mērvienību (EUR)",2018,"Ievadiet daudzumu","Cena par daudzumu (EUR)","Piezīmes"]
[1,2,3,null,4,null,5,6,7]
["Pildvielu frakcija 2-8 mm"]
[1,"Betons C 8/10","m³",51,50.724512806473001,{"$f":"D4*0.957264957","v":48.820512807},null,{"$f":"IF(ISNUMBER(G4),G4*F4,\"\")","v":""}]
[2,"Betons C 12/15","m³",53.33,53.041926822925589,{"$f":"D5*0.957264957","v":51.05094015681},null,{"$f":"IF(ISNUMBER(G5),G5*E5,\"\")","v":""}]
[3,"Betons C 16/20","m³",56,55.697504258088003,53.606837592000005,null,{"$f":"IF(ISNUMBER(G6),G6*E6,\"\")","v":""}]
[4,"Betons C 20/25","m³",59.5,59.178598274218501,56.9572649415,null,""]
[5,"Betons C 25/30","m³",61.83,61.496012290671089,59.18769229131,null,""]
[6,"Betons C 30/37","m³",63.83,63.485208871317091,61.102222205309999,null,""]
[7,"Betons C 35/45","m³",69.75,69.373230750029251,66.769230750749998,null,""]
["Pildvielu frakcija 8-16 mm"]
[8,"Betons C 8/10","m³",49.83,49.560832806795091,{"$f":"D12*0.957264957","v":47.700512807309998},null,""]
[9,"Betons C 12/15","m³",52.83,52.544627677764083,{"$f":"D13*0.957264957","v":50.572307678309997},null,""]
[10,"Betons C 16/20","m³",55.33,55.031123403571591,52.965470070809999,null,""]
[11,"Betons C 20/25","m³",58.5,58.183999983895504,55.9999999845,null,""]
[12,"Betons C 25/30","m³",60.5,60.173196564541499,57.9145298985,null,""]
[13,"Betons C 30/37","m³",64.66,64.310725452285183,61.896752119619997,null,""]
[14,"Betons C 35/45","m³",71,70.616478612933008,67.965811947000006,null,""]
["Cementa java (pildvielu frakcija 0-3 mm)"]
[15,"Marka M50","m³",48.5,50.162832690388356,{"$f":"D20*0.9954621849","v":48.279915967650005},null,""]
[16,"Marka M75","m³",51.75,53.524259623249428,51.515168068575001,null,""]
[17,"Marka M100","m³",54.83,56.709858070391611,54.581191598067001,null,""]
[18,"Marka M150","m³",59.17,61.19865588227379,58.901497480533003,null,""]
[19,"Marka M200","m³",63.5,65.677110842054844,63.21184874115,null,""]
[20,"Marka M250","m³",67.33,69.638423196780366,67.024468909317008,null,""]
[21,"Marka M300","m³",69,71.365679497665909,68.686890758100006,null,""]
[22,"Marka M350","m³",71,73.43424991788811,70.677815127900004,null,""]
[23,"Marka M400","m³",73.5,76.019962943165851,73.166470590149999,null,""]
["Transportēšana un iestrāde"]
[24,"Transports uz objektu","EUR/km",1.05,0.98704999999999998,0.95,null,""]
[25,"Betona sūknēšana","EUR/h",69.5,70.132499999999993,67.5,null,""]
[]
[null,"Piezīmes:","1. Saraksta secībai nav nekāda sakara ar būvmateriālu vai būvizstrādājumu kvalitātes rādītājiem vai izmantošanas iespējamību. Saraksts izveidots nejaušā secībā;"]
[null,null,"3. Būvmateriālu vai būvizstrādājumu patiesās cenas var mainīties atkarībā no to piegādātāja vai tirgotāja piedāvājuma izmaiņām;"]
[null,null,"3 Katalogā redzamās būvmateriālu vai būvizstrādājumu cenas ir vidējās Latvijas mazumtirzniecības cenas bez PVN (21%);"]

{"sheet":"Sheet1","index":10,"n_rows":0,"n_cols":0,"rows_kept":0,"cut":false,"hidden":true,"merged":[]}

{"sheet":"Stiegrojums","index":11,"n_rows":37,"n_cols":9,"rows_kept":37,"cut":false,"hidden":false,"merged":[[37,2,37,8],[15,2,15,8],[2,0,2,1],[2,7,2,8],[15,0,15,1],[35,1,36,1],[34,2,34,8],[35,2,35,8],[36,2,36,8]]}
["Nr.p.k.","Nosaukums","Mērvienība",2017,"Cena par mērvienību (EUR)",2018,"Ievadiet daudzumu ","Cena par daudzumu (EUR)","Piezīmes"]
[1,2,3,null,4,null,5,6,7]
["Atsevišķas stiegras",null,null,null,null,null,"Metros"]
[1,"Ø 6 mm,  B500B","t",346.61,636.08000000000004,636.08000000000004,null,{"$f":"IF(ISNUMBER(G4),G4*0.00022*E4,\"\")","v":""},"1 metra masa 0,22 kg"]
[2,"Ø 8 mm, B500B","t",346.61,636.08000000000004,636.08000000000004,null,{"$f":"IF(ISNUMBER(G5),G5*0.0004*E5,\"\")","v":""},"1 metra masa 0,40 kg"]
[3,"Ø 10 mm, B500B","t",346.61,636.08000000000004,636.08000000000004,null,{"$f":"IF(ISNUMBER(G6),G6*0.00062*E6,\"\")","v":""},"1 metra masa 0,62 kg"]
[4,"Ø 12 mm, B500B","t",346.61,636.08000000000004,636.08000000000004,null,{"$f":"IF(ISNUMBER(G7),G7*0.00089*E7,\"\")","v":""},"1 metra masa 0,89 kg"]
[5,"Ø 14 mm, B500B","t",346.61,636.08000000000004,636.08000000000004,null,{"$f":"IF(ISNUMBER(G8),G8*0.00121*E8,\"\")","v":""},"1 metra masa 1,21 kg"]
[6,"Ø 16 mm, B500B","t",346.61,636.08000000000004,636.08000000000004,null,{"$f":"IF(ISNUMBER(G9),G9*0.00158*E9,\"\")","v":""},"1 metra masa 1,58 kg"]
[7,"Ø 18 mm, B500B","t",346.61,636.08000000000004,636.08000000000004,null,{"$f":"IF(ISNUMBER(G10),G10*0.002*E10,\"\")","v":""},"1 metra masa 2,00 kg"]
[8,"Ø 20 mm, B500B","t",346.61,636.08000000000004,636.08000000000004,null,{"$f":"IF(ISNUMBER(G11),G11*0.00247*E11,\"\")","v":""},"1 metra masa 2,47 kg"]
[9,"Ø 22 mm, B500B","t",346.61,636.08000000000004,636.08000000000004,null,{"$f":"IF(ISNUMBER(G12),G12*0.00298*E12,\"\")","v":""},"1 metra masa 2,98 kg"]
[10,"Ø 25 mm, B500B","t",346.61,636.08000000000004,636.08000000000004,null,{"$f":"IF(ISNUMBER(G13),G13*0.00385*E13,\"\")","v":""},"1 metra masa 3,85 kg"]
[11,"Ø 28 mm, B500B","t",346.61,636.08000000000004,636.08000000000004,null,{"$f":"IF(ISNUMBER(G14),G14*0.00483*E14,\"\")","v":""},"1 metra masa 4,83 kg"]
[12,"Ø 32 mm, B500B","t",346.61,636.08000000000004,636.08000000000004,null,{"$f":"IF(ISNUMBER(G15),G15*0.00631*E15,\"\")","v":""},"1 metra masa 6,31 kg"]
["Stiegrojuma siets",null,{"$f":"IF(ISNUMBER(G16),G16*D16,\"\")","v":""}]
[13,"Ø 4 mm, 100x100 mm, B500B","m2",1.28,1.3917767441767681,{"$f":"D17*1.0465116279","v":1.339534883712},null,{"$f":"IF(ISNUMBER(G17),G17*E17,\"\")","v":""}]
[14,"Ø 4 mm, 150x150mm, B500B","m2",0.86,0.93509999999376592,{"$f":"D18*1.0465116279","v":0.89999999999399993},null,{"$f":"IF(ISNUMBER(G18),G18*E18,\"\")","v":""}]
[15,"Ø 4 mm, 200x200mm, B500B","m2",0.73,0.79374767441331295,0.76395348836699994,null,""]
[16,"Ø 5 mm, 100x100 mm, B500B","m2",2.06,2.2398906976594861,2.155813953474,null,""]
[17,"Ø 5 mm, 150x150mm, B500B","m2",1.38,1.5005093023155778,1.4441860465019998,null,""]
[18,"Ø 5 mm, 200x200mm, B500B","m2",1.2,1.30479069766572,1.2558139534799999,null,""]
[19,"Ø 6 mm, 100x100 mm, B500B","m2",3.01,3.2728499999781806,3.1499999999789998,null,{"$f":"IF(ISNUMBER(G23),G23*E23,\"\")","v":""}]
[20,"Ø 6 mm, 150x150mm, B500B","m2",1.95,2.1202848837067951,2.0406976744050001,null,{"$f":"IF(ISNUMBER(G24),G24*E24,\"\")","v":""}]
[21,"Ø 6 mm, 200x200mm, B500B","m2",1.58,1.717974418593198,1.6534883720819999,null,""]
[22,"Ø 8 mm, 100x100 mm, B500B","m2",4.45,4.8385988371770452,4.6569767441550001,null,""]
[23,"Ø 8 mm, 150x150mm, B500B","m2",2.92,3.1749906976532518,3.0558139534679998,null,""]
[24,"Ø 8 mm, 200x200mm, B500B","m2",2.21,2.4029895348677011,2.312790697659,null,""]
[25,"Ø 10 mm, 100x100 mm, B500B","m2",7.01,7.6221523255305801,7.3360465115789992,null,""]
[26,"Ø 10 mm, 150x150mm, B500B","m2",5.25,5.7084593022875252,5.4941860464749999,null,""]
[27,"Ø 10 mm, 200x200mm, B500B","m2",3.18,3.4576953488141582,3.3279069767220002,null,""]
[28,"Ø 12 mm, 150x150mm, B500B","m2",7.89,8.5789988371521098,8.2569767441310002,null,""]
[29,"Ø 12 mm, 200x200mm, B500B","m2",5.53,6.0129104650761924,5.7872093022869997,null,""]
[]
[null,"Piezīmes:","1. Saraksta secībai nav nekāda sakara ar būvmateriālu vai būvizstrādājumu kvalitātes rādītājiem vai izmantošanas iespējamību. Saraksts izveidots nejaušā secībā;"]
[null,null,"3. Būvmateriālu vai būvizstrādājumu patiesās cenas var mainīties atkarībā no to piegādātāja vai tirgotāja piedāvājuma izmaiņām;"]
[null,null,"3 Katalogā redzamās būvmateriālu vai būvizstrādājumu cenas ir vidējās Latvijas mazumtirzniecības cenas bez PVN (21%);"]

{"sheet":"Ķieģeļi","index":12,"n_rows":33,"n_cols":9,"rows_kept":33,"cut":false,"hidden":false,"merged":[[30,2,30,8],[31,1,32,1],[31,2,31,8],[32,2,32,8],[2,0,2,1],[7,0,7,1],[7,2,7,8],[2,2,2,8],[13,0,13,1],[13,2,13,8]]}
["Nr.p.k.","Nosaukums","Mērvienība",2017,"Cena par mērvienību (EUR)",2018,"Ievadiet daudzumu ","Cena par daudzumu (EUR)","Piezīmes"]
[1,2,3,null,4,null,5,6,7]
["Celtniecības ķieģeļi"]
[1,"Lode, caurumotais, 250x120x88 mm","gab.",0.24,0.30477333333333284,{"$f":"D4*1.22222222222222","v":0.29333333333333284},null,{"$f":"IF(ISNUMBER(G4),G4*E4,\"\")","v":""}]
[2,"Lode, caurumotais, 250x120x65 mm","gab.",0.26,0.33017111111111053,{"$f":"D5*1.22222222222222","v":0.31777777777777722},null,{"$f":"IF(ISNUMBER(G5),G5*E5,\"\")","v":""}]
[3,"Lode, pilnais, 250x120x65 mm","gab.",0.36,0.45715999999999918,0.43999999999999923,null,""]
[4,"Silikāta ķieģeļi M200 balts, 250x120x88 mm","gab.",0.23,0.29207444444444397,0.28111111111111065,null,""]
["Krāsns- dūmvadu ķieģeļi"]
[5,"Lode, dūmvadu ķieģelis, 250x85x65 mm","gab.",0.44,0.5587511111110095,{"$f":"D9*1.222222222222","v":0.53777777777767999},null,""]
[6,"Lode, dūmvadu ķieģelis, 250x120x65 mm","gab.",0.56999999999999995,0.72383666666653501,{"$f":"D10*1.222222222222","v":0.69666666666653998},null,""]
[7,"Lode, krāsns ķieģelis, 250x120x65 mm","gab.",0.47,0.59684777777766918,0.57444444444433995,null,""]
[8,"Šamota, Ša-5 ugunsdrošie, 230x114x65 mm","gab.",0.77,0.97781444444426668,0.94111111111094004,null,""]
[9,"Šamota, Ša-8 ugunsdrošie, 250x124x65 mm","gab.",0.92,1.1682977777775654,1.1244444444442401,null,""]
["Apdares ķieģeļi"]
[10,"Lode, Asais Brunis, 250x120x65 mm","gab.",0.47,0.59684777777669262,{"$f":"D15*1.22222222222","v":0.57444444444340004},null,""]
[11,"Lode, Asais Janka, 250x120x65 mm","gab.",0.3,0.38096666666597401,{"$f":"D16*1.22222222222","v":0.36666666666600001},null,""]
[12,"Lode, Brunis, 250x120x65 mm","gab.",0.41,0.52065444444349784,0.50111111111020001,null,""]
[13,"Lode, Janka, 250x120x65 mm","gab.",0.35,0.44446111111030301,0.42777777777699999,null,""]
[14,"Lode, Mārtiņš, 250x120x65 mm","gab.",0.55000000000000004,0.69843888888761918,0.67222222222100014,null,""]
[15,"Lode, Rudīte, 250x120x65 mm","gab.",0.55000000000000004,0.69843888888761918,0.67222222222100014,null,""]
[16,"Lode, Rūdis, 250x120x65 mm","gab.",0.47,0.59684777777669262,0.57444444444340004,null,""]
[17,"Lode, Sarmīte, 250x120x65 mm","gab.",0.48,0.60954666666555846,0.58666666666560008,null,""]
[18,"Lode, Vecā Sarmīte, 250x120x65 mm","gab.",0.48,0.60954666666555846,0.58666666666560008,null,""]
[19,"Lode, Asā Sarmīte, 250x120x65 mm","gab.",0.48,0.60954666666555846,0.58666666666560008,null,""]
[20,"Lode, Sencis, 250x120x65 mm","gab.",1.57,1.9937255555519309,1.9188888888854003,null,""]
[21,"Lode, Skarbais Janka, 250x120x65 mm","gab.",0.35,0.44446111111030301,0.42777777777699999,null,""]
[22,"Lode, Vecais Brunis, 250x120x65 mm","gab.",0.47,0.59684777777669262,0.57444444444340004,null,""]
[23,"Lode Vecais Janka, 250x120x65 mm","gab.",0.35,0.44446111111030301,0.42777777777699999,null,""]
[24,"Lode Vecais Rūdis, 250x120x65 mm","gab.",0.47,0.59684777777669262,0.57444444444340004,null,""]
[]
[null,"Piezīmes:","1. Saraksta secībai nav nekāda sakara ar būvmateriālu vai būvizstrādājumu kvalitātes rādītājiem vai izmantošanas iespējamību. Saraksts izveidots nejaušā secībā;"]
[null,null,"3. Būvmateriālu vai būvizstrādājumu patiesās cenas var mainīties atkarībā no to piegādātāja vai tirgotāja piedāvājuma izmaiņām;"]
[null,null,"3 Katalogā redzamās būvmateriālu vai būvizstrādājumu cenas ir vidējās Latvijas mazumtirzniecības cenas bez PVN (21%);"]

{"sheet":"Ruļmateriāli","index":13,"n_rows":58,"n_cols":9,"rows_kept":58,"cut":false,"hidden":false,"merged":[[57,2,57,8],[14,2,14,8],[2,2,2,8],[21,2,21,8],[29,2,29,8],[39,2,39,8],[45,2,45,8],[45,0,45,1],[54,2,54,8],[55,1,56,1],[55,2,55,8],[56,2,56,8],[2,0,2,1],[14,0,14,1],[21,0,21,1],[29,0,29,1],[39,0,39,1]]}
["Nr.p.k.","Nosaukums","Mērvienība",2017,"Cena par mērvienību (EUR)",2018,"Ievadiet daudzumu ","Cena par daudzumu (EUR)","Piezīmes"]
[1,2,3,null,4,null,5,6,7]
["Polietilēna plēves"]
[1,"Polietilēna plēve, caurspīdīga, 0,1 mm","m²",0.19,0.20680671600000003,{"$f":"D4*1.0476","v":0.19904400000000003},null,{"$f":"IF(ISNUMBER(G4),G4*E4,\"\")","v":""}]
[2,"Polietilēna plēve, caurspīdīga, 0,12 mm","m²",0.21,0.228575844,{"$f":"D5*1.0476","v":0.219996},null,{"$f":"IF(ISNUMBER(G5),G5*E5,\"\")","v":""}]
[3,"Polietilēna plēve, caurspīdīga, 0,15 mm","m²",0.24,0.26122953600000004,0.25142400000000004,null,""]
[4,"Polietilēna plēve, caurspīdīga, 0,2 mm","m²",0.37,0.40272886800000002,0.38761200000000001,null,""]
[5,"Polietilēna plēve, melna, 0,1 mm","m²",0.12,0.13061476800000002,0.12571200000000002,null,""]
[6,"Polietilēna plēve, melna, 0,12 mm","m²",0.16,0.17415302400000002,0.16761600000000001,null,""]
[7,"Polietilēna plēve, melna, 0,15 mm","m²",0.17,0.18503758800000003,0.17809200000000003,null,""]
[8,"Polietilēna plēve, melna, 0,2 mm","m²",0.21,0.228575844,0.219996,null,""]
[9,"Polietilēna plēve, dzeltena, 0,15 mm","m²",0.16,0.17415302400000002,0.16761600000000001,null,""]
[10,"Polietilēna plēve, dzeltena, 0,2 mm","m²",0.23,0.250344972,0.24094800000000002,null,""]
[11,"Baseina plēve, 0,3 mm","m²",1.22,1.3279168080000001,1.2780720000000001,null,""]
["Pretvēja plēves"]
[12,"JUTADACH 85 ","m²",0.56999999999999995,0.620420148,{"$f":"D16*1.0476","v":0.597132},null,""]
[13,"BITUPAP 125 Bitumena papīrs","m²",0.28000000000000003,0.30476779200000004,{"$f":"D17*1.0476","v":0.29332800000000003},null,""]
[14,"DALTEX Frameshield 100 Pluss ","m²",0.38,0.41361343200000006,0.39808800000000005,null,""]
[15,"TYVEK UV Facade ","m²",2.87,3.1238698680000003,3.0066120000000005,null,""]
[16,"TYVEK HouseWrap ","m²",0.91,0.99049532400000018,0.95331600000000016,null,""]
[17,"TYVEK Enerco Wall ","m²",2.72,2.9606014080000005,2.8494720000000004,null,""]
["Antikondensāta jumtu plēves"]
[18,"ELKATEK SILVER ANTICON","m²",0.35,0.38074154999999993,{"$f":"D23*1.047","v":0.36644999999999994},null,""]
[19,"JUTA-FOIL D110","m²",0.28999999999999998,0.31547156999999998,{"$f":"D24*1.047","v":0.30362999999999996},null,""]
[20,"ELKATEK SILVER ","m²",0.27,0.29371491,0.28269,null,""]
[21,"ELKATEK EXTRA L","m²",0.44,0.47864651999999996,0.46067999999999998,null,""]
[22,"JUTACON 130","m²",0.56999999999999995,0.62006480999999991,0.59678999999999993,null,""]
[23,"JUTACON 150","m²",0.55000000000000004,0.59830814999999993,0.57584999999999997,null,""]
[24,"ELKATEK white anticon","m²",0.28999999999999998,0.31547156999999998,0.30362999999999996,null,""]
["Tvaika izolācijas plēves"]
[null,"ELT-PEFOIL 200","m²",0.4,0.43538256000000009,{"$f":"D31*1.0476","v":0.41904000000000008},null,""]
[25,"ALUPAP 125","m²",0.37,0.40272886800000002,{"$f":"D32*1.0476","v":0.38761200000000001},null,""]
[26,"ELT-KRAFT VCL","m²",0.52,0.56599732800000002,0.54475200000000001,null,""]
[27,"ELTBAR Alu","m²",0.43,0.46803625200000004,0.45046800000000004,null,""]
[28,"JUTADACH VB 120","m²",0.73,0.79457317200000011,0.76474800000000009,null,""]
[29,"TYVEK Airguard Sd5","m²",1.35,1.4694161400000003,1.4142600000000003,null,""]
[30,"TYVEK DUPONT AirGuard Reflective","m²",1.99,2.1660282359999998,2.084724,null,""]
[31,"TYVEK AIRGUARD Smart","m²",2.17,2.3619503879999999,2.2732920000000001,null,""]
[32,"Isover Tvaika barjera VARIO KM DUPLEX","m²",2.19,2.3837195159999998,2.294244,null,""]
["Siltumnīcas plēves"]
[33,"UV siltumnīcas plēve, 0,12 mm","m²",0.22,0.23946040800000001,{"$f":"D41*1.0476","v":0.23047200000000001},null,""]
[34,"UV siltumnīcas plēve, 0,15 mm","m²",0.27,0.29388322800000005,{"$f":"D42*1.0476","v":0.28285200000000005},null,""]
[35,"UV siltumnīcas plēve, 0,2 mm","m²",0.36,0.39184430400000003,0.37713600000000003,null,""]
[36,"Jutafol Agro 118 armētā plēve, 0,12 mm","m²",0.56999999999999995,0.620420148,0.597132,null,""]
[37,"Agrolux daudzgadīgā plēve, 0,15 mm","m²",0.51,0.55511276400000009,0.53427600000000008,null,""]
["Ģeotekstils"]
[38,"GeoNetex A PP TT UVLS","m²",0.61,0.66395840400000006,{"$f":"D47*1.0476","v":0.63903600000000005},null,""]
[39,"Agroplēve PP Ground Cover","m²",0.38,0.41361343200000006,{"$f":"D48*1.0476","v":0.39808800000000005},null,""]
[40,"DuPont PLANTEX","m²",0.32,0.34830604800000003,0.33523200000000003,null,""]
[41,"TYPAR SF20","m²",0.56000000000000005,0.60953558400000007,0.58665600000000007,null,""]
[42,"NETEX HOME 100","m²",0.34,0.37007517600000006,0.35618400000000006,null,""]
[43,"GEOPROMA DuPont","m²",0.56999999999999995,0.620420148,0.597132,null,""]
[44,"PROTYPAR PRO","m²",0.7,0.76191947999999998,0.73331999999999997,null,""]
[]
[null,"Piezīmes:","1. Saraksta secībai nav nekāda sakara ar būvmateriālu vai būvizstrādājumu kvalitātes rādītājiem vai izmantošanas iespējamību. Saraksts izveidots nejaušā secībā;"]
[null,null,"3. Būvmateriālu vai būvizstrādājumu patiesās cenas var mainīties atkarībā no to piegādātāja vai tirgotāja piedāvājuma izmaiņām;"]
[null,null,"3 Katalogā redzamās būvmateriālu vai būvizstrādājumu cenas ir vidējās Latvijas mazumtirzniecības cenas bez PVN (21%);"]
[null,null,"4 Būvmateriālu vai būvizstrādājumu cenas ir norādītas bez PVN (21%), kā arī mazumtirzniecībā;"]

{"sheet":"Hidroizolācijas mat.","index":14,"n_rows":28,"n_cols":9,"rows_kept":28,"cut":false,"hidden":false,"merged":[[27,2,27,8],[2,2,2,8],[11,2,11,8],[2,0,2,1],[11,0,11,1],[24,2,24,8],[25,1,26,1],[25,2,25,8],[26,2,26,8]]}
["Nr.p.k.","Nosaukums","Mērvienība",2017,"Cena par mērvienību (EUR)",2018,"Ievadiet daudzumu ","Cena par daudzumu (EUR)","Piezīmes"]
[1,2,3,null,4,null,5,6,7]
["Hidroizolācija"]
[1,"Knauf Kaučuka hidroziolācija Flaechendicht F","kg",2.2999999999999998,4.1559989609999999,{"$f":"D4*1.73913","v":3.9999989999999999},null,{"$f":"IF(ISNUMBER(G4),G4*E4,\"\")","v":""},"Patēriņš 2,00 kg/m²"]
[2,"Sakret Virsmas hidroizolācija OAD","kg",2.08,3.7584686255999999,{"$f":"D5*1.73913","v":3.6173904000000001},null,{"$f":"IF(ISNUMBER(G5),G5*E5,\"\")","v":""},"Patēriņš 1,00 kg/m²"]
[3,"Weber  Hidroizolācija Weber.tec 822","kg",2.5299999999999998,4.5715988570999997,4.3999988999999999,null,"","Patēriņš 1,00 kg/m²"]
[4,"Casco Hydrostop","kg",3.56,6.4327636092000002,6.1913027999999999,null,"","Patēriņš 1,33 kg/m²"]
[5,"Mapei Mapegum WPS","kg",3.88,7.0109895515999998,6.7478243999999998,null,"","Patēriņš 1,50 kg/m²"]
[6,"Kiilto Hidroizolācija Fibergum","kg",2.72,4.9149205104000009,4.7304336000000005,null,"","Patēriņš 1,20 kg/m²"]
[7,"Mapei Mapegum PU","kg",5.15,9.3058237605000009,8.9565195000000006,null,"","Patēriņš 1,40 kg/m²"]
[8,"Mapei Mapelastic Foundation","kg",2.68,4.8426422675999996,4.6608684,null,"","Patēriņš 1,40 kg/m²"]
["Bituma mastika"]
[9,"Bitumena špakteļmasa DEN BIT-U","kg",2.02,3.6500512614000002,{"$f":"D13*1.73913","v":3.5130426000000003},null,""]
[10,"Bitumena hidroizolācijas masa DEN BIT-M","kg",1.01,1.8250256307000001,{"$f":"D14*1.73913","v":1.7565213000000002},null,""]
[11,"Divkomponentu hidroizolācija DEN BIT-F","kg",2.1,3.7946077470000001,3.6521730000000003,null,""]
[12,"Bitumena hidroizolācijas masa DEN BIT-D","kg",1.6,2.8911297120000001,2.7826080000000002,null,""]
[13,"Bitumena līme ruberoīdam DEN BIT-P","kg",1.43,2.5839471801,2.4869558999999999,null,""]
[14,"Bitumena grunts DEN BIT-R","kg",1.53,2.7646427871000001,{"$f":"D18*1.73913","v":2.6608689000000001},null,""]
[15,"Techno Nicol Mastika EVRIKA Nr.41","kg",2.17,3.9210946719000002,3.7739121,null,""]
[16,"Techno Nicol Mastika VIŠERA Nr. 22","kg",1.38,2.4935993766000002,2.3999994,null,""]
[17,"Techno Nicol Mastika TECHOMAST Nr.21","kg",1.77,3.1983122439000002,3.0782601000000001,null,""]
[18,"Techno Nicol Bitumena mastika MGTN Nr.24","kg",1.0900000000000001,1.9695821163000002,1.8956517000000002,null,""]
[19,"Techno Nicol Mastika FIKSER Nr. 23","kg",0.54,0.97575627780000018,0.93913020000000014,null,""]
[]
[null,"Piezīmes:","1. Saraksta secībai nav nekāda sakara ar būvmateriālu vai būvizstrādājumu kvalitātes rādītājiem vai izmantošanas iespējamību. Saraksts izveidots nejaušā secībā;"]
[null,null,"3. Būvmateriālu vai būvizstrādājumu patiesās cenas var mainīties atkarībā no to piegādātāja vai tirgotāja piedāvājuma izmaiņām;"]
[null,null,"3 Katalogā redzamās būvmateriālu vai būvizstrādājumu cenas ir vidējās Latvijas mazumtirzniecības cenas bez PVN (21%);"]
[null,null,"4 Būvmateriālu vai būvizstrādājumu cenas ir norādītas bez PVN (21%), kā arī mazumtirzniecībā;"]

{"sheet":"Sausie m.","index":15,"n_rows":66,"n_cols":8,"rows_kept":66,"cut":false,"hidden":false,"merged":[[2,0,2,1],[2,2,2,7],[11,0,11,1],[11,2,11,7],[62,2,62,7],[55,0,55,1],[55,2,55,8],[65,2,65,7],[24,0,24,1],[24,2,24,7],[36,0,36,1],[36,2,36,7],[45,0,45,1],[45,2,45,7],[63,1,64,1],[63,2,63,7],[64,2,64,7]]}
["Nr.p.k.","Nosaukums","Mērvienība","Cena par mērvienību (EUR)",2018,"Ievadiet daudzumu ","Cena par daudzumu (EUR)","Piezīmes"]
[1,2,3,4,null,5,6,7]
["Cements/betons"]
[1,"CEMEX CEM 42,5N Cements, 40kg","iep.",3.5533799999999998,3.42,null,{"$f":"IF(ISNUMBER(F4),F4*D4,\"\")","v":""}]
[2,"SAKRET BE betons-klons, 40 kg","iep.",2.5039899999999999,2.41,null,{"$f":"IF(ISNUMBER(F5),F5*D5,\"\")","v":""}]
[3,"Weber (Vetonit) floor base 10, 25 kg","iep.",2.0364399999999998,1.96,null,""]
[4,"SAKRET BF Betons-klons, 25 kg","iep.",2.3065800000000003,2.2200000000000002,null,""]
[5,"SAKRET BH Betons klons, 40kg","iep.",3.6676699999999998,3.53,null,""]
[6,"Weber (vetonit) S-30 rupjais, 25kg","iep.",3.6572800000000001,3.52,null,""]
[7,"SAKRET Aalborg CEM I 52,5 R, 25kg","iep.",5.8391799999999998,5.62,null,""]
[8,"WEBER (Vetonit) S06, 25kg","iep.",4.1456100000000005,3.99,null,""]
["Flīžu līme"]
[8,"Knauf K6, 25kg","iep.",10.628970000000001,10.23,null,""]
[9,"Knauf K5, 25kg","iep.",8.4990199999999998,8.18,null,""]
[10,"Knauf K4, 25kg","iep.",6.6807699999999999,6.43,null,""]
[11,"Knauf K3, 25kg","iep.",10.10947,9.73,null,""]
[12,"Knauf K2, 25kg","iep.",4.86252,4.68,null,""]
[13,"Knauf K1, 25kg","iep.",3.9585900000000001,3.81,null,""]
[14,"Sakret FK, 25kg","iep.",4.6235499999999998,4.45,null,""]
[15,"Sakret Fke, 25kg","iep.",6.3378999999999994,6.1,null,""]
[16,"Sakret FKW, 25kg","iep.",11.19003,10.77,null,""]
[17,"Sakret FFK, 25kg","iep.",8.7691599999999994,8.44,null,""]
[18,"Sakret FFKS, 25kg","iep.",11.709529999999999,11.27,null,""]
[19,"Weber HANDY FIX, 25kg","iep.",7.3041700000000001,7.03,null,""]
["Špakteles"]
[20,"Knauf Uniflott, 25kg","iep.",20.250109999999999,19.489999999999998,null,""]
[21,"Weber (Vetonit) LR+, 25kg","iep.",9.2678799999999999,8.92,null,""]
[22,"KILTO Kestonit LH, 25kg","iep.",5.8703500000000002,5.65,null,""]
[23,"Knauf Fugenfuller Ieicht, 25kg","iep.",13.132960000000001,12.64,null,""]
[24,"KILTO Kestonit SH, 20kg","iep.",6.0262000000000002,5.8,null,""]
[25,"KILTO Kestonit WSH, 20kg","iep.",8.8107199999999999,8.48,null,""]
[26,"Knauf Q-Filler, 25kg","iep.",12.63424,12.16,null,""]
[27,"Weber (Vetonit) VR, 20kg","iep.",6.3275100000000002,6.09,null,""]
[28,"Weber (Vetonit) VH, 25kg","iep.",11.179639999999999,10.76,null,""]
[29,"Knauf Baugips, Būvniecības ģipsis, 25kg","iep.",3.0234900000000002,2.91,null,""]
[30,"Knauf Fireboard, 20kg","iep.",16.592829999999999,15.97,null,""]
["Apmetumi"]
[31,"Knauf MP 75, 30kg","iep.",3.9066399999999999,3.76,null,""]
[32,"Kanuf MP 75 L, 30kg","iep.",4.2287300000000005,4.07,null,""]
[33,"Knauf Rotband, 30kg","iep.",6.5664800000000003,6.32,null,""]
[34,"Kanuf Perlfix, 30kg","iep.",5.7872300000000001,5.57,null,""]
[35,"Sakret PM Super M5, 40kg","iep.",3.5845500000000001,3.45,null,""]
[36,"Sakret CLP+CSII, 40kg","iep.",5.2261700000000006,5.03,null,""]
[37,"Knauf Goldband, 30kg","iep.",7.07559,6.81,null,""]
[38,"Knauf KZ Universalputz, 30kg","iep.",3.3663600000000002,3.24,null,""]
["Līmēšanas/armēšanas javas"]
[39,"Sakret BK, 25kg","iep.",3.6364999999999998,3.5,null,""]
[40,"Sakret BAK, 25kg","iep.",4.1663899999999998,4.01,null,""]
[41,"Knauf PM Kleber, 25kg","iep.",4.4469200000000004,4.28,null,""]
[42,"Knauf Klebespachtel P, 25kg","iep.",4.7274500000000002,4.55,null,""]
[43,"Knauf Klebespachtel M, 25kg","iep.",5.5794300000000003,5.37,null,""]
[44,"Sakret BAK-F, 25kg","iep.",5.6417699999999993,5.43,null,""]
[45,"Sakret KAM, 25kg","iep.",7.5327500000000001,7.25,null,""]
[46,"CAPAROL CT 185 Klebemasse, 25kg","iep.",5.9638600000000004,5.74,null,""]
[47,"CAPAROL CT 186 M Klebe und Spachtelmasse, 25kg","iep.",5.6729399999999996,5.46,null,""]
["Dekoratīvie apmetumi"]
[48,"Sakret SBP (biezpiens), 25kg","iep.",6.2547799999999993,6.02,null,""]
[49,"Sakret MRP-E (lietutuņš), 25kg","iep.",6.2547799999999993,6.02,null,""]
[50,"Knauf Dekorputz (lietutuņš), 25kg","iep.",6.9405199999999994,6.68,null,""]
[51,"Knauf Strukturputz (biezpiens), 25kg","iep.",7.3353399999999995,7.06,null,""]
[52,"CAPAROL Capatec Mineral-Leichtputz CT 139, 25kg","iep.",6.0677599999999998,5.84,null,""]
[]
[null,"Piezīmes:","1. Saraksta secībai nav nekāda sakara ar būvmateriālu vai būvizstrādājumu kvalitātes rādītājiem vai izmantošanas iespējamību. Saraksts izveidots nejaušā secībā;"]
[null,null,"3. Būvmateriālu vai būvizstrādājumu patiesās cenas var mainīties atkarībā no to piegādātāja vai tirgotāja piedāvājuma izmaiņām;"]
[null,null,"3 Katalogā redzamās būvmateriālu vai būvizstrādājumu cenas ir vidējās Latvijas mazumtirzniecības cenas bez PVN (21%);"]
[null,null,"4 Būvmateriālu vai būvizstrādājumu cenas ir norādītas bez PVN (21%), kā arī mazumtirzniecībā;"]

{"sheet":"Būvkalumi","index":16,"n_rows":128,"n_cols":9,"rows_kept":128,"cut":false,"hidden":false,"merged":[[112,2,112,8],[51,0,51,1],[72,0,72,1],[76,0,76,1],[91,0,91,1],[101,0,101,1],[112,0,112,1],[51,2,51,8],[72,2,72,8],[76,2,76,8],[91,2,91,8],[101,2,101,8],[124,2,124,8],[125,1,126,1],[125,2,125,8],[126,2,126,8],[127,2,127,8],[34,0,34,1],[34,2,34,8],[42,0,42,1],[42,2,42,8],[2,0,2,1],[2,2,2,8],[23,0,23,1],[23,2,23,8],[30,0,30,1],[30,2,30,8]]}
["Nr.p.k.","Nosaukums","Mērvienība",2017,"Cena par mērvienību (EUR)",2018,"Ievadiet daudzumu ","Cena par daudzumu (EUR)","Piezīmes"]
[1,2,3,null,4,null,5,6,7]
["Leņķi"]
[1,"Leņķis 40x40x40x2","gab.",0.22,0.18237758175999999,{"$f":"D4*0.797872","v":0.17553183999999999},null,{"$f":"IF(ISNUMBER(G4),G4*E4,\"\")","v":""}]
[2,"Leņķis 40x40x60x2","gab.",0.27,0.22382703216000002,{"$f":"D5*0.797872","v":0.21542544000000002},null,{"$f":"IF(ISNUMBER(G5),G5*E5,\"\")","v":""}]
[3,"Leņķis 50x50x40x2","gab.",0.24,0.19895736192000002,0.19148928000000001,null,""]
[4,"Leņķis 60x60x40x2","gab.",0.27,0.22382703216000002,0.21542544000000002,null,""]
[5,"Leņķis 60x60x50x2","gab.",0.33,0.27356637264000006,0.26329776000000005,null,""]
[6,"Leņķis 60x60x60x2","gab.",0.35,0.2901461528,0.27925519999999998,null,""]
[7,"Leņķis 60x60x80x2","gab.",0.5,0.41449450399999999,0.39893600000000001,null,""]
[8,"Leņķis 70x70x55x2","gab.",0.34,0.28185626272000003,0.27127648000000004,null,""]
[9,"Leņķis 80x80x60x2","gab.",0.54,0.44765406432000004,0.43085088000000005,null,""]
[10,"Leņķis 80x80x80x2","gab.",0.59,0.48910351471999997,0.47074447999999997,null,""]
[11,"Leņķis 80x80x100x2","gab.",0.75,0.62174175600000003,0.59840400000000005,null,""]
[12,"Leņķis 90x90x40x2","gab.",0.4,0.33159560320000003,0.31914880000000001,null,""]
[13,"Leņķis 90x90x65x2","gab.",0.49,0.40620461392000001,0.39095728000000002,null,""]
[14,"Leņķis 100x100x40x2","gab.",0.49,0.40620461392000001,0.39095728000000002,null,""]
[15,"Leņķis 100x100x60x2","gab.",0.64,0.53055296511999994,0.51063807999999999,null,""]
[16,"Leņķis 100x100x80x2","gab.",0.75,0.62174175600000003,0.59840400000000005,null,""]
[17,"Leņķis 100x100x100x2","gab.",0.82,0.67977098656000001,0.65425504000000001,null,""]
[18,"Leņķis 106x106x90x2","gab.",0.81,0.67148109647999998,0.64627632000000002,null,""]
[19,"Leņķis 120x40x40x2","gab.",0.59,0.48910351471999997,0.47074447999999997,null,""]
[20,"Leņķis 120x80x40x2","gab.",0.62,0.51397318496,0.49468064,null,""]
["Stūra leņķi"]
[21,"Leņķis 70x70x55x2","gab.",0.34,0.28185626272000003,0.27127648000000004,null,""]
[22,"Leņķis 70x70x55x2.5","gab.",0.4,0.33159560320000003,0.31914880000000001,null,""]
[23,"Leņķis 90x90x65x2","gab.",0.49,0.40620461392000001,0.39095728000000002,null,""]
[24,"Leņķis 90x90x65x2.5","gab.",0.56999999999999995,0.47252373455999996,0.45478703999999998,null,""]
[25,"Leņķis 106x106x90x2","gab.",0.81,0.67148109647999998,0.64627632000000002,null,""]
[26,"Leņķis 106x106x90x2.5","gab.",0.94,0.77924966751999991,0.74999967999999995,null,""]
["Pastiprināti stūra leņķi ar ribu"]
[27,"Leņķis ar ribu 70x70x55x2.5","gab.",0.4,0.33159560320000003,0.31914880000000001,null,""]
[28,"Leņķis ar ribu 90x90x65x2.5","gab.",0.56999999999999995,0.47252373455999996,0.45478703999999998,null,""]
[29,"Leņķis ar ribu 106x106x90x2.5","gab.",0.94,0.77924966751999991,0.74999967999999995,null,""]
["Brusu kurpes"]
[30,"Brusu kurpe 105x79x51x2","gab.",0.92,0.76266988736000008,0.73404224000000007,null,""]
[31,"Brusu kurpe 100x79x60x2","gab.",0.92,0.76266988736000008,0.73404224000000007,null,""]
[32,"Brusu kurpe 122x79x76x2","gab.",1.06,0.87872834848000014,0.8457443200000001,null,""]
[33,"Brusu kurpe 120x79x80x2","gab.",1.06,0.87872834848000014,0.8457443200000001,null,""]
[34,"Brusu kurpe 140x76x100x2","gab.",1.21,1.00307669968,0.96542512000000003,null,""]
[35,"Brusu kurpe 160x76x120x2","gab.",1.47,1.2186138417600001,1.17287184,null,""]
[36,"Brusu kurpe 180x76x140x2","gab.",1.66,1.3761217532800001,1.32446752,null,""]
["Spāru leņķi"]
[37,"Spāru leņķis 32x100x170x2 - Labais","gab.",0.31,0.25698659248,0.24734032,null,""]
[38,"Spāru leņķis 32x100x170x2 - Kreisais","gab.",0.31,0.25698659248,0.24734032,null,""]
[39,"Spāru leņķis 34x140x210x2 - Labais","gab.",0.36,0.29843604287999997,0.28723391999999998,null,""]
[40,"Spāru leņķis 34x140x210x2 - Kreisais","gab.",0.36,0.29843604287999997,0.28723391999999998,null,""]
[41,"Spāru leņķis 34x180x250x2 - Labais","gab.",0.48,0.39791472384000004,0.38297856000000002,null,""]
[42,"Spāru leņķis 34x180x250x2 - Kreisais","gab.",0.48,0.39791472384000004,0.38297856000000002,null,""]
[43,"Spāru leņķis 34x220x290x2 - Labais","gab.",0.62,0.51397318496,0.49468064,null,""]
[44,"Spāru leņķis 34x220x290x2 - Kreisais","gab.",0.62,0.51397318496,0.49468064,null,""]
["Savienojuma plates"]
[45,"Savienojuma plate 40x120x2","gab.",0.27,0.22382703216000002,0.21542544000000002,null,""]
[46,"Savienojuma plate 40x140x2","gab.",0.32,0.26527648255999997,0.25531904,null,""]
[47,"Savienojuma plate 40x160x2","gab.",0.41,0.33988549328000001,0.32712752,null,""]
[48,"Savienojuma plate 50x160x2","gab.",0.48,0.39791472384000004,0.38297856000000002,null,""]
[49,"Savienojuma plate 50x200x2","gab.",0.54,0.44765406432000004,0.43085088000000005,null,""]
[50,"Savienojuma plate 50x240x2","gab.",0.6,0.49739340479999999,0.47872320000000002,null,""]
[51,"Savienojuma plate 60x120x2","gab.",0.45,0.37304505360000006,0.35904240000000004,null,""]
[52,"Savienojuma plate 60x140x2","gab.",0.5,0.41449450399999999,0.39893600000000001,null,""]
[53,"Savienojuma plate 60x160x2","gab.",0.52,0.43107428415999999,0.41489344,null,""]
[54,"Savienojuma plate 60x200x2","gab.",0.67,0.55542263536000014,0.53457424000000009,null,""]
[55,"Savienojuma plate 60x240x2","gab.",0.77,0.63832153616000009,0.61436144000000004,null,""]
[56,"Savienojuma plate 60x300x2","gab.",0.81,0.67148109647999998,0.64627632000000002,null,""]
[57,"Savienojuma plate 80x200x2","gab.",0.76,0.63003164608000006,0.60638272000000004,null,""]
[58,"Savienojuma plate 80x240x2","gab.",0.85,0.70464065679999999,0.67819119999999999,null,""]
[59,"Savienojuma plate 80x300x2","gab.",0.95,0.78753955759999994,0.75797839999999994,null,""]
[60,"Savienojuma plate 100x140x2","gab.",0.67,0.55542263536000014,0.53457424000000009,null,""]
[61,"Savienojuma plate 100x160x2","gab.",0.77,0.63832153616000009,{"$f":"D69*0.797872","v":0.61436144000000004},null,{"$f":"IF(ISNUMBER(G69),G69*E69,\"\")","v":""}]
[62,"Savienojuma plate 100x200x2","gab.",0.87,0.72122043695999993,0.69414863999999998,null,""]
[63,"Savienojuma plate 100x240x2","gab.",0.95,0.78753955759999994,0.75797839999999994,null,""]
[64,"Savienojuma plate 100x300x2","gab.",1.22,1.0113665897599999,0.97340384000000002,null,""]
["Montāžas lenta"]
[65,"Montāžas lenta 25x2mm - 25m","iep.",43.88,36.376037671040002,{"$f":"D74*0.797872","v":35.010623360000004},null,{"$f":"IF(ISNUMBER(G74),G74*E74,\"\")","v":""}]
[66,"Montāžas lenta 40x2mm - 25m","iep.",46.09,38.208103378720004,36.773920480000001,null,""]
[67,"Montāžas lenta 60x2mm - 25m","iep.",65.819999999999993,54.564056506559993,52.515935039999995,null,""]
["Balsta kurpes"]
[68,"Balsta kurpes 5x50x60x105x200","gab.",3.51,2.9097514180799999,{"$f":"D78*0.797872","v":2.8005307199999998},null,{"$f":"IF(ISNUMBER(G78),G78*E78,\"\")","v":""}]
[69,"Balsta kurpes 5x75x60x125x200","gab.",3.62,3.0009402089599999,2.8882966400000001,null,""]
[70,"Balsta kurpes 5x100x60x125x200","gab.",3.82,3.16673801056,3.04787104,null,""]
[71,"Balsta kurpes 5x120x60x100x200","gab.",3.92,3.2496369113600001,3.1276582400000001,null,""]
[72,"Balsta kurpes 5x150x60x125x200","gab.",4.07,3.3739852625600006,3.2473390400000004,null,""]
[73,"Balsta kurpes (L-veida) 5x60x60x125x200","gab.",2.89,2.3957782331200006,2.3058500800000004,null,""]
[74,"Balsta kurpes (T-veida) 5x90x60x70x110","gab.",3.1,2.5698659248000002,2.4734032000000004,null,""]
[75,"Balsta kurpes (U-veida) 5x50x130x130x120","gab.",6.62,5.4879072329599996,5.2819126399999998,null,""]
[76,"Balsts stabiem (iesitams zemē) 51x600x150x450x2","gab.",3.78,3.1335784502399999,3.01595616,null,""]
[77,"Balsts stabiem (iesitams zemē) 71x750x150x600x2","gab.",4.79,3.97085734832,3.82180688,null,""]
[78,"Balsts stabiem (iesitams zemē) 100x900x150x750x2","gab.",5.95,4.9324845976000002,4.7473384000000003,null,""]
[79,"Stabu balsti 50x100x100x2","gab.",3.3,2.7356637263999999,2.6329775999999998,null,""]
[80,"Stabu balsti 70x120x120x2","gab.",3.72,3.0838391097600004,2.9680838400000003,null,""]
[81,"Stabu balsti 100x150x140x2","gab.",4.34,3.5978122947200002,3.4627644800000001,null,""]
["Montāžas kronšteins"]
[82,"Montāžas kronšteins 250x200x50x2,5x5","gab.",3.34,2.76882328672,{"$f":"D93*0.797872","v":2.6648924799999998},null,{"$f":"IF(ISNUMBER(G93),G93*E93,\"\")","v":""}]
[83,"Montāžas kronšteins B 300x200x50x2,5x5","gab.",3.99,3.3076661419200004,3.1835092800000004,null,""]
[84,"Montāžas kronšteins A 300x200x50x2,5x5","gab.",3.78,3.1335784502399999,3.01595616,null,""]
[85,"Montāžas kronšteins 400x200x50x2,5x5","gab.",4.6500000000000004,3.8547988872000003,3.7101048000000003,null,""]
[86,"Montāžas kronšteins 500x200x50x2,5x5","gab.",5.08,4.2112641606400008,4.0531897600000004,null,""]
[87,"Montāžas kronšteins 600x200x50x2,5x5","gab.",5.81,4.8164261364799996,4.6356363199999997,null,""]
[88,"Montāžas kronšteins 800x200x50x2,5x5","gab.",7.26,6.0184601980800005,5.7925507200000004,null,""]
[89,"Montāžas kronšteins 1000x200x50x2,5x5","gab.",9.44,7.8256562355199994,7.5319116799999994,null,""]
[90,"Montāžas kronšteins 1250x200x50x2,5x5","gab.",9.8699999999999992,8.1821215089599999,7.87499664,null,""]
["Mēbeļu stūrīši"]
[91,"Mēbeļu stūrīši 1,5x30x30/30","gab.",0.1,8.2898900800000008E-2,{"$f":"D103*0.797872","v":7.9787200000000003E-2},null,{"$f":"IF(ISNUMBER(G103),G103*E103,\"\")","v":""}]
[92,"Mēbeļu stūrīši 2x15x30/30","gab.",0.08,6.6319120639999993E-2,6.3829759999999999E-2,null,""]
[93,"Mēbeļu stūrīši 2x15x40/40","gab.",0.1,8.2898900800000008E-2,7.9787200000000003E-2,null,""]
[94,"Mēbeļu stūrīši 2x15x50/50","gab.",0.11,9.1188790879999995E-2,8.7765919999999997E-2,null,""]
[95,"Mēbeļu stūrīši 2x20x40/40","gab.",0.1,8.2898900800000008E-2,7.9787200000000003E-2,null,""]
[96,"Mēbeļu stūrīši 2x20x60/60","gab.",0.15,0.1243483512,0.1196808,null,""]
[97,"Mēbeļu stūrīši 2x20x80/80","gab.",0.19,0.15750791152000002,0.15159568000000001,null,""]
[98,"Mēbeļu stūrīši 2x20x100/100","gab.",0.24,0.19895736192000002,0.19148928000000001,null,""]
[99,"Mēbeļu stūrīši 2x30x40/40","gab.",0.15,0.1243483512,0.1196808,null,""]
[100,"Mēbeļu stūrīši 2x30x50/50","gab.",0.17,0.14092813136000001,0.13563824000000002,null,""]
["Naglu plates",null,{"$f":"IF(ISNUMBER(G113),G113*D113,\"\")","v":""}]
[101,"Naglu plāksnes 101 - 70 x 80","gab.",0.25,0.20724725199999999,{"$f":"D114*0.797872","v":0.19946800000000001},null,{"$f":"IF(ISNUMBER(G114),G114*E114,\"\")","v":""}]
[102,"Naglu plāksnes 101 - 70 x 120","gab.",0.28999999999999998,0.24040681232,0.23138287999999999,null,""]
[103,"Naglu plāksnes 101 - 70 x 160","gab.",0.38,0.31501582304000003,0.30319136000000002,null,""]
[104,"Naglu plāksnes 101 - 70 x 200","gab.",0.42,0.34817538335999998,0.33510624,null,""]
[105,"Naglu plāksnes 101 - 77 x 200","gab.",0.47,0.38962483375999996,0.37499983999999997,null,""]
[106,"Naglu plāksnes 101 - 98 x 200","gab.",0.64,0.53055296511999994,0.51063807999999999,null,""]
[107,"Naglu plāksnes 101 - 120 x 160","gab.",0.63,0.52226307504000002,0.50265936,null,""]
[108,"Naglu plāksnes 101 - 120 x 200","gab.",0.73,0.60516197584000009,0.58244656000000006,null,""]
[109,"Naglu plāksnes 101 - 120 x 240","gab.",0.91,0.75437999728000005,0.72606352000000007,null,""]
[110,"Naglu plāksnes 101 - 120 x 280","gab.",1.45,1.2020340616,1.1569144,null,""]
[]
[null,"Piezīmes:","1. Saraksta secībai nav nekāda sakara ar būvmateriālu vai būvizstrādājumu kvalitātes rādītājiem vai izmantošanas iespējamību. Saraksts izveidots nejaušā secībā;"]
[null,null,"3. Būvmateriālu vai būvizstrādājumu patiesās cenas var mainīties atkarībā no to piegādātāja vai tirgotāja piedāvājuma izmaiņām;"]
[null,null,"3 Katalogā redzamās būvmateriālu vai būvizstrādājumu cenas ir vidējās Latvijas mazumtirzniecības cenas bez PVN (21%);"]
[null,null,"4 Būvmateriālu vai būvizstrādājumu cenas ir norādītas bez PVN (21%), kā arī mazumtirzniecībā;"]

{"sheet":"Terauda","index":17,"n_rows":127,"n_cols":9,"rows_kept":127,"cut":false,"hidden":false,"merged":[[2,0,2,1],[2,2,2,8],[126,2,126,8],[100,0,100,1],[35,0,35,1],[16,0,16,1],[43,0,43,1],[16,2,16,8],[35,2,35,8],[43,2,43,8],[100,2,100,8],[123,2,123,8],[124,1,125,1],[124,2,124,8],[125,2,125,8]]}
["Nr.p.k.","Nosaukums","Mērvienība",2017,"Cena par mērvienību (EUR)",2018,"Ievadiet daudzumu ","Cena par daudzumu (EUR)","Piezīmes"]
[1,2,3,null,4,null,5,6,7]
["Apaļdzelzs"]
[1,"6 mm","m",0.24,0.19946628573120001,{"$f":"(D4-(D4*0.21))*1.012548","v":0.1919791008},null,{"$f":"IF(ISNUMBER(G4),G4*E4,\"\")","v":""}]
[2,"8 mm","m",0.39,0.32413271431320007,0.31196603880000007,null,{"$f":"IF(ISNUMBER(G5),G5*E5,\"\")","v":""}]
[3,"10 mm","m",0.6,0.498665714328,0.47994775200000001,null,""]
[4,"12 mm","m",0.84,0.69813200005919995,0.67192685279999997,null,""]
[5,"14 mm","m",1.2,0.997331428656,0.95989550400000001,null,""]
[6,"16 mm","m",1.48,1.2300420953424001,1.1838711216,null,""]
[7,"18 mm","m",1.93,1.6040413810883998,1.5438319355999999,null,""]
[8,"20 mm","m",2.5,2.0777738097,1.9997823000000001,null,""]
[9,"60 mm","m",36,29.919942859679999,28.79686512,null,""]
[10,"70 mm","m",48.7,40.475033812955999,38.955759203999996,null,""]
[11,"80 mm","m",64.400000000000006,53.523453337872006,51.514392048000005,null,""]
[12,"90 mm","m",80.400000000000006,66.821205719952005,64.312998768,null,""]
[13,"100 mm","m",99.5,82.69539762606,79.591335540000003,null,""]
["Apaļcaurule",null,{"$f":"IF(ISNUMBER(G17),G17*F17,\"\")","v":""}]
[14,"10x1 mm","m",0.7,0.58177666671599992,0.55993904399999994,null,{"$f":"IF(ISNUMBER(G18),G18*E18,\"\")","v":""}]
[15,"21.3x2.6 mm","m",1.5,1.2466642858199999,1.19986938,null,{"$f":"IF(ISNUMBER(G19),G19*E19,\"\")","v":""}]
[16,"25x4 mm","m",5.3,4.4048804765639993,4.239538475999999,null,""]
[17,"26.9x2.6 mm","m",1.9,1.579108095372,1.519834548,null,""]
[18,"33.7x2.9 mm","m",2.52,2.0943960001775999,2.0157805583999999,null,""]
[19,"40x10 mm ","m",27.3,22.689290001924,21.837622715999998,null,""]
[20,"42.4x3.2 mm","m",3.6,2.991994285968,2.8796865120000001,null,""]
[21,"45x10 mm","m",30.87,25.656351002175601,24.6933118404,null,""]
[22,"48.3x3.2 mm","m",4.0999999999999996,3.4075490479080002,3.279642972,null,""]
[23,"51x6.3 mm","m",16,13.297752382080001,12.79860672,null,""]
[24,"57x4 mm","m",12.2,10.139536191335999,9.7589376239999996,null,""]
[25,"60.3x3.2 mm","m",5.8,4.8204352385040004,4.6394949360000002,null,""]
[26,"60.3x10 mm","m",27.45,22.813956430506,21.957609653999999,null,""]
[27,"76.1x3.2 mm","m",6.4,5.3191009528320006,5.1194426880000004,null,""]
[28,"88.9x3.2 mm","m",7.5,6.2333214291000001,5.9993468999999999,null,""]
[29,"89x3.6 mm","m",8.6,7.1475419053679996,6.8792511119999995,null,""]
[30,"95x1.5 mm","m",6.1,5.0697680956679996,4.8794688119999998,null,""]
[31,"139.7x4 mm","m",17.2,14.295083810735999,13.758502223999999,null,""]
["Kvadrātdzelzs",null,{"$f":"IF(ISNUMBER(G36),G36*F36,\"\")","v":""}]
[32,"6x6 mm","m",0.87,0.72306528577560003,0.6959242404,null,{"$f":"IF(ISNUMBER(G37),G37*E37,\"\")","v":""}]
[33,"10x10 mm","m",0.79,0.65657652386520016,0.63193120680000014,null,{"$f":"IF(ISNUMBER(G38),G38*E38,\"\")","v":""}]
[34,"12x12 mm","m",1.1000000000000001,0.91422047626800018,0.87990421200000013,null,""]
[35,"14x14 mm","m",1.5,1.2466642858199999,1.19986938,null,""]
[36,"16x16 mm","m",1.8,1.495997142984,1.4398432560000001,null,""]
[37,"20x20 mm","m",3.15,2.6179950002220003,2.5197256980000002,null,""]
[38,"30x30 mm","m",7.82,6.4992764767416,6.2553190344000003,null,""]
["Leņķtērauds",null,{"$f":"IF(ISNUMBER(G44),G44*F44,\"\")","v":""}]
[39,"20x20x3 mm","m",1.1000000000000001,0.91422047626800018,0.87990421200000013,null,{"$f":"IF(ISNUMBER(G45),G45*E45,\"\")","v":""}]
[40,"20x20x4 mm","m",1.03,0.85604280959640011,0.82391030760000006,null,{"$f":"IF(ISNUMBER(G46),G46*E46,\"\")","v":""}]
[41,"25x25x3 mm","m",1.2,0.997331428656,0.95989550400000001,null,""]
[42,"25x25x4 mm","m",1.8,1.495997142984,1.4398432560000001,null,""]
[43,"30x30x3 mm","m",1.44,1.1967977143872,1.1518746047999999,null,""]
[44,"35x35x4 mm","m",2.04,1.6954634287152002,1.6318223568000001,null,""]
[45,"40x20x4 mm","m",1.59,1.3214641429692,1.2718615428,null,""]
[46,"40x40x4 mm","m",2.4,1.994662857312,1.919791008,null,""]
[47,"40x40x5 mm","m",2.67,2.2190624287596004,2.1357674964000002,null,""]
[48,"45x45x4 mm","m",2.06,1.7120856191928002,1.6478206152000001,null,""]
[49,"45x45x5 mm","m",3.04,2.5265729525951999,2.4317352768,null,""]
[50,"50x30x5 mm","m",2.4900000000000002,2.0694627144612001,1.9917831708000002,null,""]
[51,"50x50x4 mm","m",2.75,2.2855511906699997,2.1997605299999998,null,""]
[52,"50x50x4 mm","m",3.54,2.9421277145352005,2.8316917368000003,null,""]
[53,"50x50x5 mm","m",4.0199999999999996,3.3410602859976,3.2156499383999999,null,""]
[54,"50x50x6 mm","m",5.24,4.3550139051311998,4.1915437007999996,null,""]
[55,"50x50x8 mm","m",2.66,2.2107513335208,2.1277683671999998,null,""]
[56,"60x30x5 mm","m",3.59,2.9836831907292001,2.8716873828000002,null,""]
[57,"60x30x6 mm","m",3.38,2.8091501907143996,2.7037056695999997,null,""]
[58,"60x40x6 mm","m",4.01,3.3327491907588001,3.2076508092,null,""]
[59,"60x60x5 mm","m",4.7,3.9062147622359999,3.7595907240000002,null,""]
[60,"60x60x6 mm","m",4.88,4.0558144765344002,3.9035750496000001,null,""]
[61,"65x50x7 mm","m",5.37,4.4630581432356005,4.2955323804000001,null,""]
[62,"65x65x7 mm","m",6.15,5.111323571862,4.9194644580000002,null,""]
[63,"70x50x5 mm","m",4.2699999999999996,3.5488376669675996,{"$f":"(D69-(D69*0.21))*1.012548","v":3.4156281683999996},null,""]
[64,"70x70x5 mm","m",4.83,4.0142590003404006,3.8635794036000002,null,""]
[65,"70x70x6 mm","m",6.1,5.0697680956679996,4.8794688119999998,null,""]
[66,"70x70x7 mm","m",6.64,5.5185672385631994,5.3114217887999997,null,""]
[67,"70x70x9 mm","m",8.41,6.9896310958308003,6.7272676572000005,null,""]
[68,"75x50x5 mm","m",4.2699999999999996,3.5488376669675996,3.4156281683999996,null,""]
[69,"75x50x5 mm","m",4.2699999999999996,3.5488376669675996,3.4156281683999996,null,""]
[70,"75x50x6 mm","m",5.08,4.2220363813104003,4.0635576336000003,null,""]
[71,"75x50x7 mm","m",5.87,4.8786129051755998,4.6954888403999995,null,""]
[72,"75x75x6 mm","m",6.17,5.1279457623395999,4.9354627164,null,""]
[73,"75x75x8 mm","m",8.6,7.1475419053679996,6.8792511119999995,null,""]
[74,"75x75x10 mm","m",9.99,8.3027841435611993,7.9911300707999997,null,""]
[75,"80x40x6 mm","m",4.87,4.0475033812956003,3.8955759204000002,null,""]
[76,"80x40x8 mm","m",6.36,5.2858565718768,5.0874461711999999,null,""]
[77,"80x80x6 mm","m",6.61,5.4936339528467997,5.2874244012,null,""]
[78,"80x80x8 mm","m",8.69,7.2223417625172006,6.9512432748000004,null,""]
[79,"80x80x10 mm","m",10.71,8.9011830007548003,8.5670673732000004,null,""]
[80,"90x60x8 mm","m",8.06,6.6987427624727998,6.4472981351999996,null,""]
[81,"90x90x9 mm","m",10.98,9.1255825722024007,8.7830438616000013,null,""]
[82,"100x50x6 mm","m",6.17,5.1279457623395999,4.9354627164,null,""]
[83,"100x50x8 mm","m",9.19,7.6378965244571999,7.3511997347999998,null,""]
[84,"100x50x10 mm","m",9.99,8.3027841435611993,7.9911300707999997,null,""]
[85,"100x65x7 mm","m",7.89,6.5574541434132003,6.3113129388000004,null,""]
[86,"100x65x8 mm","m",8.91,7.4051858577707996,7.1272241171999999,null,""]
[87,"100x65x9 mm","m",9.99,8.3027841435611993,7.9911300707999997,null,""]
[88,"100x75x7 mm","m",8.39,6.9730089053532005,6.7112693988000007,null,""]
[89,"100x75x8 mm","m",8.39,6.9730089053532005,6.7112693988000007,null,""]
[90,"100x75x9 mm","m",10.62,8.8263831436056002,8.4950752103999996,null,""]
[91,"100x100x8 mm","m",12.2,10.139536191335999,9.7589376239999996,null,""]
[92,"100x100x10 mm","m",11.96,9.940069905604803,9.5669585232000021,null,""]
[93,"100x100x12 mm","m",16.02,13.314374572557599,12.814604978399998,null,""]
[94,"110x110x10 mm","m",14.94,12.416776286767201,11.9506990248,null,""]
["Plakandzelzs",null,{"$f":"IF(ISNUMBER(G101),G101*F101,\"\")","v":""}]
[95,"20x4 mm","m",null,0.42,0,null,{"$f":"IF(ISNUMBER(G102),G102*E102,\"\")","v":""}]
[96,"25x4 mm","m",0.7,0.58177666671599992,0.55993904399999994,null,{"$f":"IF(ISNUMBER(G103),G103*E103,\"\")","v":""}]
[97,"25x5 mm","m",0.76,0.63164323814879997,0.6079338192,null,{"$f":"IF(ISNUMBER(G104),G104*E104,\"\")","v":""}]
[98,"30x4 mm","m",0.99,0.82279842864120001,0.79191379080000002,null,""]
[99,"40x5 mm","m",0.96,0.79786514292480004,0.76791640319999999,null,""]
[100,"40x6 mm","m",1.23,1.0222647143724,0.98389289160000004,null,""]
[101,"40x10 mm ","m",3,2.4933285716399998,2.39973876,null,""]
[102,"50x4 mm","m",1.48,1.2300420953424001,1.1838711216,null,""]
[103,"50x5 mm","m",1.9,1.579108095372,1.519834548,null,""]
[104,"50x8 mm","m",2.96,2.4600841906848001,2.3677422431999999,null,""]
[105,"50x10 mm","m",3.7,3.075105238356,2.959677804,null,""]
[106,"60x10 mm","m",4.63,3.8480370955644001,3.7035968196,null,""]
[107,"60x6 mm","m",2.85,2.3686621430580002,2.2797518220000001,null,""]
[108,"70x8 mm","m",3.95,3.2828826193260001,3.1596560340000002,null,""]
[109,"70x10 mm","m",5,4.1555476194000001,3.9995646000000002,null,""]
[110,"80x6 mm","m",3.7,3.075105238356,2.959677804,null,""]
[111,"80x8 mm","m",4.5,3.7399928574599999,3.59960814,null,""]
[112,"80x10 mm","m",4.96,4.1223032384448004,3.9675680832000002,null,""]
[113,"100x6 mm","m",4.5,3.7399928574599999,3.59960814,null,""]
[114,"100x8 mm","m",5.99,4.9783460480411996,4.7914783908,null,""]
[115,"100x10 mm","m",7.58,6.2998101910104003,6.0633399336,null,""]
[]
[null,"Piezīmes:","1. Saraksta secībai nav nekāda sakara ar būvmateriālu vai būvizstrādājumu kvalitātes rādītājiem vai izmantošanas iespējamību. Saraksts izveidots nejaušā secībā;"]
[null,null,"3. Būvmateriālu vai būvizstrādājumu patiesās cenas var mainīties atkarībā no to piegādātāja vai tirgotāja piedāvājuma izmaiņām;"]
[null,null,"3 Katalogā redzamās būvmateriālu vai būvizstrādājumu cenas ir vidējās Latvijas mazumtirzniecības cenas bez PVN (21%);"]
[null,null,"4 Būvmateriālu vai būvizstrādājumu cenas ir norādītas bez PVN (21%), kā arī mazumtirzniecībā;"]

{"sheet":"Starpt","index":18,"n_rows":840,"n_cols":8,"rows_kept":840,"cut":false,"hidden":true,"merged":[]}
["Nr.p.k.","Nosaukums","Mērvienība","Cena par mērvienību (EUR)","Ievadiet daudzumu","Cena par daudzumu (EUR)","Piezīmes","Value"]
[{"$f":"IF(ISNUMBER('Gāzbetona bl.'!G3),'Gāzbetona bl.'!A3,\"\")","v":""},{"$f":"IF(ISNUMBER('Gāzbetona bl.'!G3),'Gāzbetona bl.'!B3,\"\")","v":""},{"$f":"IF(ISNUMBER('Gāzbetona bl.'!G3),'Gāzbetona bl.'!C3,\"\")","v":""},{"$f":"IF(ISNUMBER('Gāzbetona bl.'!G3),'Gāzbetona bl.'!E3,\"\")","v":""},{"$f":"IF(ISNUMBER('Gāzbetona bl.'!G3),'Gāzbetona bl.'!G3,\"\")","v":""},{"$f":"IF(ISNUMBER('Gāzbetona bl.'!G3),'Gāzbetona bl.'!H3,\"\")","v":""},{"$f":"IF(ISTEXT('Gāzbetona bl.'!I3),'Gāzbetona bl.'!I3,\"\")","v":""},{"$f":"IF(ISNUMBER(E2),\"yes\",\"\")","v":""}]
[{"$f":"IF(ISNUMBER('Gāzbetona bl.'!G4),'Gāzbetona bl.'!A4,\"\")","v":""},{"$f":"IF(ISNUMBER('Gāzbetona bl.'!G4),'Gāzbetona bl.'!B4,\"\")","v":""},{"$f":"IF(ISNUMBER('Gāzbetona bl.'!G4),'Gāzbetona bl.'!C4,\"\")","v":""},{"$f":"IF(ISNUMBER('Gāzbetona bl.'!G4),'Gāzbetona bl.'!E4,\"\")","v":""},{"$f":"IF(ISNUMBER('Gāzbetona bl.'!G4),'Gāzbetona bl.'!G4,\"\")","v":""},{"$f":"IF(ISNUMBER('Gāzbetona bl.'!G4),'Gāzbetona bl.'!H4,\"\")","v":""},{"$f":"IF(ISTEXT('Gāzbetona bl.'!I4),'Gāzbetona bl.'!I4,\"\")","v":""},{"$f":"IF(ISNUMBER(E3),\"yes\",\"\")","v":""}]
[{"$f":"IF(ISNUMBER('Gāzbetona bl.'!G5),'Gāzbetona bl.'!A5,\"\")","v":""},{"$f":"IF(ISNUMBER('Gāzbetona bl.'!G5),'Gāzbetona bl.'!B5,\"\")","v":""},{"$f":"IF(ISNUMBER('Gāzbetona bl.'!G5),'Gāzbetona bl.'!C5,\"\")","v":""},{"$f":"IF(ISNUMBER('Gāzbetona bl.'!G5),'Gāzbetona bl.'!E5,\"\")","v":""},{"$f":"IF(ISNUMBER('Gāzbetona bl.'!G5),'Gāzbetona bl.'!G5,\"\")","v":""},{"$f":"IF(ISNUMBER('Gāzbetona bl.'!G5),'Gāzbetona bl.'!H5,\"\")","v":""},{"$f":"IF(ISTEXT('Gāzbetona bl.'!I5),'Gāzbetona bl.'!I5,\"\")","v":""},""]
[{"$f":"IF(ISNUMBER('Gāzbetona bl.'!G6),'Gāzbetona bl.'!A6,\"\")","v":""},{"$f":"IF(ISNUMBER('Gāzbetona bl.'!G6),'Gāzbetona bl.'!B6,\"\")","v":""},{"$f":"IF(ISNUMBER('Gāzbetona bl.'!G6),'Gāzbetona bl.'!C6,\"\")","v":""},{"$f":"IF(ISNUMBER('Gāzbetona bl.'!G6),'Gāzbetona bl.'!E6,\"\")","v":""},{"$f":"IF(ISNUMBER('Gāzbetona bl.'!G6),'Gāzbetona bl.'!G6,\"\")","v":""},{"$f":"IF(ISNUMBER('Gāzbetona bl.'!G6),'Gāzbetona bl.'!H6,\"\")","v":""},{"$f":"IF(ISTEXT('Gāzbetona bl.'!I6),'Gāzbetona bl.'!I6,\"\")","v":""},""]
[{"$f":"IF(ISNUMBER('Gāzbetona bl.'!G7),'Gāzbetona bl.'!A7,\"\")","v":""},{"$f":"IF(ISNUMBER('Gāzbetona bl.'!G7),'Gāzbetona bl.'!B7,\"\")","v":""},{"$f":"IF(ISNUMBER('Gāzbetona bl.'!G7),'Gāzbetona bl.'!C7,\"\")","v":""},{"$f":"IF(ISNUMBER('Gāzbetona bl.'!G7),'Gāzbetona bl.'!E7,\"\")","v":""},{"$f":"IF(ISNUMBER('Gāzbetona bl.'!G7),'Gāzbetona bl.'!G7,\"\")","v":""},{"$f":"IF(ISNUMBER('Gāzbetona bl.'!G7),'Gāzbetona bl.'!H7,\"\")","v":""},{"$f":"IF(ISTEXT('Gāzbetona bl.'!I7),'Gāzbetona bl.'!I7,\"\")","v":""},""]
[{"$f":"IF(ISNUMBER('Gāzbetona bl.'!G8),'Gāzbetona bl.'!A8,\"\")","v":""},{"$f":"IF(ISNUMBER('Gāzbetona bl.'!G8),'Gāzbetona bl.'!B8,\"\")","v":""},{"$f":"IF(ISNUMBER('Gāzbetona bl.'!G8),'Gāzbetona bl.'!C8,\"\")","v":""},{"$f":"IF(ISNUMBER('Gāzbetona bl.'!G8),'Gāzbetona bl.'!E8,\"\")","v":""},{"$f":"IF(ISNUMBER('Gāzbetona bl.'!G8),'Gāzbetona bl.'!G8,\"\")","v":""},{"$f":"IF(ISNUMBER('Gāzbetona bl.'!G8),'Gāzbetona bl.'!H8,\"\")","v":""},{"$f":"IF(ISTEXT('Gāzbetona bl.'!I8),'Gāzbetona bl.'!I8,\"\")","v":""},""]
[{"$f":"IF(ISNUMBER('Gāzbetona bl.'!G9),'Gāzbetona bl.'!A9,\"\")","v":""},{"$f":"IF(ISNUMBER('Gāzbetona bl.'!G9),'Gāzbetona bl.'!B9,\"\")","v":""},{"$f":"IF(ISNUMBER('Gāzbetona bl.'!G9),'Gāzbetona bl.'!C9,\"\")","v":""},{"$f":"IF(ISNUMBER('Gāzbetona bl.'!G9),'Gāzbetona bl.'!E9,\"\")","v":""},{"$f":"IF(ISNUMBER('Gāzbetona bl.'!G9),'Gāzbetona bl.'!G9,\"\")","v":""},{"$f":"IF(ISNUMBER('Gāzbetona bl.'!G9),'Gāzbetona bl.'!H9,\"\")","v":""},{"$f":"IF(ISTEXT('Gāzbetona bl.'!I9),'Gāzbetona bl.'!I9,\"\")","v":""},""]
[{"$f":"IF(ISNUMBER('Gāzbetona bl.'!G10),'Gāzbetona bl.'!A10,\"\")","v":""},{"$f":"IF(ISNUMBER('Gāzbetona bl.'!G10),'Gāzbetona bl.'!B10,\"\")","v":""},{"$f":"IF(ISNUMBER('Gāzbetona bl.'!G10),'Gāzbetona bl.'!C10,\"\")","v":""},{"$f":"IF(ISNUMBER('Gāzbetona bl.'!G10),'Gāzbetona bl.'!E10,\"\")","v":""},{"$f":"IF(ISNUMBER('Gāzbetona bl.'!G10),'Gāzbetona bl.'!G10,\"\")","v":""},{"$f":"IF(ISNUMBER('Gāzbetona bl.'!G10),'Gāzbetona bl.'!H10,\"\")","v":""},{"$f":"IF(ISTEXT('Gāzbetona bl.'!I10),'Gāzbetona bl.'!I10,\"\")","v":""},""]
[{"$f":"IF(ISNUMBER('Gāzbetona bl.'!G11),'Gāzbetona bl.'!A11,\"\")","v":""},{"$f":"IF(ISNUMBER('Gāzbetona bl.'!G11),'Gāzbetona bl.'!B11,\"\")","v":""},{"$f":"IF(ISNUMBER('Gāzbetona bl.'!G11),'Gāzbetona bl.'!C11,\"\")","v":""},{"$f":"IF(ISNUMBER('Gāzbetona bl.'!G11),'Gāzbetona bl.'!E11,\"\")","v":""},{"$f":"IF(ISNUMBER('Gāzbetona bl.'!G11),'Gāzbetona bl.'!G11,\"\")","v":""},{"$f":"IF(ISNUMBER('Gāzbetona bl.'!G11),'Gāzbetona bl.'!H11,\"\")","v":""},{"$f":"IF(ISTEXT('Gāzbetona bl.'!I11),'Gāzbetona bl.'!I11,\"\")","v":""},""]
[{"$f":"IF(ISNUMBER('Gāzbetona bl.'!G12),'Gāzbetona bl.'!A12,\"\")","v":""},{"$f":"IF(ISNUMBER('Gāzbetona bl.'!G12),'Gāzbetona bl.'!B12,\"\")","v":""},{"$f":"IF(ISNUMBER('Gāzbetona bl.'!G12),'Gāzbetona bl.'!C12,\"\")","v":""},{"$f":"IF(ISNUMBER('Gāzbetona bl.'!G12),'Gāzbetona bl.'!E12,\"\")","v":""},{"$f":"IF(ISNUMBER('Gāzbetona bl.'!G12),'Gāzbetona bl.'!G12,\"\")","v":""},{"$f":"IF(ISNUMBER('Gāzbetona bl.'!G12),'Gāzbetona bl.'!H12,\"\")","v":""},{"$f":"IF(ISTEXT('Gāzbetona bl.'!I12),'Gāzbetona bl.'!I12,\"\")","v":""},""]
[{"$f":"IF(ISNUMBER('Gāzbetona bl.'!G13),'Gāzbetona bl.'!A13,\"\")","v":""},{"$f":"IF(ISNUMBER('Gāzbetona bl.'!G13),'Gāzbetona bl.'!B13,\"\")","v":""},{"$f":"IF(ISNUMBER('Gāzbetona bl.'!G13),'Gāzbetona bl.'!C13,\"\")","v":""},{"$f":"IF(ISNUMBER('Gāzbetona bl.'!G13),'Gāzbetona bl.'!E13,\"\")","v":""},{"$f":"IF(ISNUMBER('Gāzbetona bl.'!G13),'Gāzbetona bl.'!G13,\"\")","v":""},{"$f":"IF(ISNUMBER('Gāzbetona bl.'!G13),'Gāzbetona bl.'!H13,\"\")","v":""},{"$f":"IF(ISTEXT('Gāzbetona bl.'!I13),'Gāzbetona bl.'!I13,\"\")","v":""},""]
[{"$f":"IF(ISNUMBER('Gāzbetona bl.'!G14),'Gāzbetona bl.'!A14,\"\")","v":""},{"$f":"IF(ISNUMBER('Gāzbetona bl.'!G14),'Gāzbetona bl.'!B14,\"\")","v":""},{"$f":"IF(ISNUMBER('Gāzbetona bl.'!G14),'Gāzbetona bl.'!C14,\"\")","v":""},{"$f":"IF(ISNUMBER('Gāzbetona bl.'!G14),'Gāzbetona bl.'!E14,\"\")","v":""},{"$f":"IF(ISNUMBER('Gāzbetona bl.'!G14),'Gāzbetona bl.'!G14,\"\")","v":""},{"$f":"IF(ISNUMBER('Gāzbetona bl.'!G14),'Gāzbetona bl.'!H14,\"\")","v":""},{"$f":"IF(ISTEXT('Gāzbetona bl.'!I14),'Gāzbetona bl.'!I14,\"\")","v":""},""]
[{"$f":"IF(ISNUMBER('Gāzbetona bl.'!G15),'Gāzbetona bl.'!A15,\"\")","v":""},{"$f":"IF(ISNUMBER('Gāzbetona bl.'!G15),'Gāzbetona bl.'!B15,\"\")","v":""},{"$f":"IF(ISNUMBER('Gāzbetona bl.'!G15),'Gāzbetona bl.'!C15,\"\")","v":""},{"$f":"IF(ISNUMBER('Gāzbetona bl.'!G15),'Gāzbetona bl.'!E15,\"\")","v":""},{"$f":"IF(ISNUMBER('Gāzbetona bl.'!G15),'Gāzbetona bl.'!G15,\"\")","v":""},{"$f":"IF(ISNUMBER('Gāzbetona bl.'!G15),'Gāzbetona bl.'!H15,\"\")","v":""},{"$f":"IF(ISTEXT('Gāzbetona bl.'!I15),'Gāzbetona bl.'!I15,\"\")","v":""},""]
[{"$f":"IF(ISNUMBER('Gāzbetona bl.'!G16),'Gāzbetona bl.'!A16,\"\")","v":""},{"$f":"IF(ISNUMBER('Gāzbetona bl.'!G16),'Gāzbetona bl.'!B16,\"\")","v":""},{"$f":"IF(ISNUMBER('Gāzbetona bl.'!G16),'Gāzbetona bl.'!C16,\"\")","v":""},{"$f":"IF(ISNUMBER('Gāzbetona bl.'!G16),'Gāzbetona bl.'!E16,\"\")","v":""},{"$f":"IF(ISNUMBER('Gāzbetona bl.'!G16),'Gāzbetona bl.'!G16,\"\")","v":""},{"$f":"IF(ISNUMBER('Gāzbetona bl.'!G16),'Gāzbetona bl.'!H16,\"\")","v":""},{"$f":"IF(ISTEXT('Gāzbetona bl.'!I16),'Gāzbetona bl.'!I16,\"\")","v":""},""]
[{"$f":"IF(ISNUMBER('Gāzbetona bl.'!G17),'Gāzbetona bl.'!A17,\"\")","v":""},{"$f":"IF(ISNUMBER('Gāzbetona bl.'!G17),'Gāzbetona bl.'!B17,\"\")","v":""},{"$f":"IF(ISNUMBER('Gāzbetona bl.'!G17),'Gāzbetona bl.'!C17,\"\")","v":""},{"$f":"IF(ISNUMBER('Gāzbetona bl.'!G17),'Gāzbetona bl.'!E17,\"\")","v":""},{"$f":"IF(ISNUMBER('Gāzbetona bl.'!G17),'Gāzbetona bl.'!G17,\"\")","v":""},{"$f":"IF(ISNUMBER('Gāzbetona bl.'!G17),'Gāzbetona bl.'!H17,\"\")","v":""},{"$f":"IF(ISTEXT('Gāzbetona bl.'!I17),'Gāzbetona bl.'!I17,\"\")","v":""},""]
[{"$f":"IF(ISNUMBER('Gāzbetona bl.'!G18),'Gāzbetona bl.'!A18,\"\")","v":""},{"$f":"IF(ISNUMBER('Gāzbetona bl.'!G18),'Gāzbetona bl.'!B18,\"\")","v":""},{"$f":"IF(ISNUMBER('Gāzbetona bl.'!G18),'Gāzbetona bl.'!C18,\"\")","v":""},{"$f":"IF(ISNUMBER('Gāzbetona bl.'!G18),'Gāzbetona bl.'!E18,\"\")","v":""},{"$f":"IF(ISNUMBER('Gāzbetona bl.'!G18),'Gāzbetona bl.'!G18,\"\")","v":""},{"$f":"IF(ISNUMBER('Gāzbetona bl.'!G18),'Gāzbetona bl.'!H18,\"\")","v":""},{"$f":"IF(ISTEXT('Gāzbetona bl.'!I18),'Gāzbetona bl.'!I18,\"\")","v":""},""]
[{"$f":"IF(ISNUMBER('Gāzbetona bl.'!G19),'Gāzbetona bl.'!A19,\"\")","v":""},{"$f":"IF(ISNUMBER('Gāzbetona bl.'!G19),'Gāzbetona bl.'!B19,\"\")","v":""},{"$f":"IF(ISNUMBER('Gāzbetona bl.'!G19),'Gāzbetona bl.'!C19,\"\")","v":""},{"$f":"IF(ISNUMBER('Gāzbetona bl.'!G19),'Gāzbetona bl.'!E19,\"\")","v":""},{"$f":"IF(ISNUMBER('Gāzbetona bl.'!G19),'Gāzbetona bl.'!G19,\"\")","v":""},{"$f":"IF(ISNUMBER('Gāzbetona bl.'!G19),'Gāzbetona bl.'!H19,\"\")","v":""},{"$f":"IF(ISTEXT('Gāzbetona bl.'!I19),'Gāzbetona bl.'!I19,\"\")","v":""},""]
[{"$f":"IF(ISNUMBER('Gāzbetona bl.'!G20),'Gāzbetona bl.'!A20,\"\")","v":""},{"$f":"IF(ISNUMBER('Gāzbetona bl.'!G20),'Gāzbetona bl.'!B20,\"\")","v":""},{"$f":"IF(ISNUMBER('Gāzbetona bl.'!G20),'Gāzbetona bl.'!C20,\"\")","v":""},{"$f":"IF(ISNUMBER('Gāzbetona bl.'!G20),'Gāzbetona bl.'!E20,\"\")","v":""},{"$f":"IF(ISNUMBER('Gāzbetona bl.'!G20),'Gāzbetona bl.'!G20,\"\")","v":""},{"$f":"IF(ISNUMBER('Gāzbetona bl.'!G20),'Gāzbetona bl.'!H20,\"\")","v":""},{"$f":"IF(ISTEXT('Gāzbetona bl.'!I20),'Gāzbetona bl.'!I20,\"\")","v":""},""]
[{"$f":"IF(ISNUMBER('Gāzbetona bl.'!G21),'Gāzbetona bl.'!A21,\"\")","v":""},{"$f":"IF(ISNUMBER('Gāzbetona bl.'!G21),'Gāzbetona bl.'!B21,\"\")","v":""},{"$f":"IF(ISNUMBER('Gāzbetona bl.'!G21),'Gāzbetona bl.'!C21,\"\")","v":""},{"$f":"IF(ISNUMBER('Gāzbetona bl.'!G21),'Gāzbetona bl.'!E21,\"\")","v":""},{"$f":"IF(ISNUMBER('Gāzbetona bl.'!G21),'Gāzbetona bl.'!G21,\"\")","v":""},{"$f":"IF(ISNUMBER('Gāzbetona bl.'!G21),'Gāzbetona bl.'!H21,\"\")","v":""},{"$f":"IF(ISTEXT('Gāzbetona bl.'!I21),'Gāzbetona bl.'!I21,\"\")","v":""},""]
[{"$f":"IF(ISNUMBER('Gāzbetona bl.'!G22),'Gāzbetona bl.'!A22,\"\")","v":""},{"$f":"IF(ISNUMBER('Gāzbetona bl.'!G22),'Gāzbetona bl.'!B22,\"\")","v":""},{"$f":"IF(ISNUMBER('Gāzbetona bl.'!G22),'Gāzbetona bl.'!C22,\"\")","v":""},{"$f":"IF(ISNUMBER('Gāzbetona bl.'!G22),'Gāzbetona bl.'!E22,\"\")","v":""},{"$f":"IF(ISNUMBER('Gāzbetona bl.'!G22),'Gāzbetona bl.'!G22,\"\")","v":""},{"$f":"IF(ISNUMBER('Gāzbetona bl.'!G22),'Gāzbetona bl.'!H22,\"\")","v":""},{"$f":"IF(ISTEXT('Gāzbetona bl.'!I22),'Gāzbetona bl.'!I22,\"\")","v":""},""]
[{"$f":"IF(ISNUMBER('Gāzbetona bl.'!G23),'Gāzbetona bl.'!A23,\"\")","v":""},{"$f":"IF(ISNUMBER('Gāzbetona bl.'!G23),'Gāzbetona bl.'!B23,\"\")","v":""},{"$f":"IF(ISNUMBER('Gāzbetona bl.'!G23),'Gāzbetona bl.'!C23,\"\")","v":""},{"$f":"IF(ISNUMBER('Gāzbetona bl.'!G23),'Gāzbetona bl.'!E23,\"\")","v":""},{"$f":"IF(ISNUMBER('Gāzbetona bl.'!G23),'Gāzbetona bl.'!G23,\"\")","v":""},{"$f":"IF(ISNUMBER('Gāzbetona bl.'!G23),'Gāzbetona bl.'!H23,\"\")","v":""},{"$f":"IF(ISTEXT('Gāzbetona bl.'!I23),'Gāzbetona bl.'!I23,\"\")","v":""},""]
[{"$f":"IF(ISNUMBER('Gāzbetona bl.'!G24),'Gāzbetona bl.'!A24,\"\")","v":""},{"$f":"IF(ISNUMBER('Gāzbetona bl.'!G24),'Gāzbetona bl.'!B24,\"\")","v":""},{"$f":"IF(ISNUMBER('Gāzbetona bl.'!G24),'Gāzbetona bl.'!C24,\"\")","v":""},{"$f":"IF(ISNUMBER('Gāzbetona bl.'!G24),'Gāzbetona bl.'!E24,\"\")","v":""},{"$f":"IF(ISNUMBER('Gāzbetona bl.'!G24),'Gāzbetona bl.'!G24,\"\")","v":""},{"$f":"IF(ISNUMBER('Gāzbetona bl.'!G24),'Gāzbetona bl.'!H24,\"\")","v":""},{"$f":"IF(ISTEXT('Gāzbetona bl.'!I24),'Gāzbetona bl.'!I24,\"\")","v":""},""]
[{"$f":"IF(ISNUMBER('Gāzbetona bl.'!G25),'Gāzbetona bl.'!A25,\"\")","v":""},{"$f":"IF(ISNUMBER('Gāzbetona bl.'!G25),'Gāzbetona bl.'!B25,\"\")","v":""},{"$f":"IF(ISNUMBER('Gāzbetona bl.'!G25),'Gāzbetona bl.'!C25,\"\")","v":""},{"$f":"IF(ISNUMBER('Gāzbetona bl.'!G25),'Gāzbetona bl.'!E25,\"\")","v":""},{"$f":"IF(ISNUMBER('Gāzbetona bl.'!G25),'Gāzbetona bl.'!G25,\"\")","v":""},{"$f":"IF(ISNUMBER('Gāzbetona bl.'!G25),'Gāzbetona bl.'!H25,\"\")","v":""},{"$f":"IF(ISTEXT('Gāzbetona bl.'!I25),'Gāzbetona bl.'!I25,\"\")","v":""},""]
[{"$f":"IF(ISNUMBER('Gāzbetona bl.'!G26),'Gāzbetona bl.'!A26,\"\")","v":""},{"$f":"IF(ISNUMBER('Gāzbetona bl.'!G26),'Gāzbetona bl.'!B26,\"\")","v":""},{"$f":"IF(ISNUMBER('Gāzbetona bl.'!G26),'Gāzbetona bl.'!C26,\"\")","v":""},{"$f":"IF(ISNUMBER('Gāzbetona bl.'!G26),'Gāzbetona bl.'!E26,\"\")","v":""},{"$f":"IF(ISNUMBER('Gāzbetona bl.'!G26),'Gāzbetona bl.'!G26,\"\")","v":""},{"$f":"IF(ISNUMBER('Gāzbetona bl.'!G26),'Gāzbetona bl.'!H26,\"\")","v":""},{"$f":"IF(ISTEXT('Gāzbetona bl.'!I26),'Gāzbetona bl.'!I26,\"\")","v":""},""]
[{"$f":"IF(ISNUMBER('Gāzbetona bl.'!G27),'Gāzbetona bl.'!A27,\"\")","v":""},{"$f":"IF(ISNUMBER('Gāzbetona bl.'!G27),'Gāzbetona bl.'!B27,\"\")","v":""},{"$f":"IF(ISNUMBER('Gāzbetona bl.'!G27),'Gāzbetona bl.'!C27,\"\")","v":""},{"$f":"IF(ISNUMBER('Gāzbetona bl.'!G27),'Gāzbetona bl.'!E27,\"\")","v":""},{"$f":"IF(ISNUMBER('Gāzbetona bl.'!G27),'Gāzbetona bl.'!G27,\"\")","v":""},{"$f":"IF(ISNUMBER('Gāzbetona bl.'!G27),'Gāzbetona bl.'!H27,\"\")","v":""},{"$f":"IF(ISTEXT('Gāzbetona bl.'!I27),'Gāzbetona bl.'!I27,\"\")","v":""},""]
[{"$f":"IF(ISNUMBER('Gāzbetona bl.'!G28),'Gāzbetona bl.'!A28,\"\")","v":""},{"$f":"IF(ISNUMBER('Gāzbetona bl.'!G28),'Gāzbetona bl.'!B28,\"\")","v":""},{"$f":"IF(ISNUMBER('Gāzbetona bl.'!G28),'Gāzbetona bl.'!C28,\"\")","v":""},{"$f":"IF(ISNUMBER('Gāzbetona bl.'!G28),'Gāzbetona bl.'!E28,\"\")","v":""},{"$f":"IF(ISNUMBER('Gāzbetona bl.'!G28),'Gāzbetona bl.'!G28,\"\")","v":""},{"$f":"IF(ISNUMBER('Gāzbetona bl.'!G28),'Gāzbetona bl.'!H28,\"\")","v":""},{"$f":"IF(ISTEXT('Gāzbetona bl.'!I28),'Gāzbetona bl.'!I28,\"\")","v":""},""]
[{"$f":"IF(ISNUMBER('Gāzbetona bl.'!G29),'Gāzbetona bl.'!A29,\"\")","v":""},{"$f":"IF(ISNUMBER('Gāzbetona bl.'!G29),'Gāzbetona bl.'!B29,\"\")","v":""},{"$f":"IF(ISNUMBER('Gāzbetona bl.'!G29),'Gāzbetona bl.'!C29,\"\")","v":""},{"$f":"IF(ISNUMBER('Gāzbetona bl.'!G29),'Gāzbetona bl.'!E29,\"\")","v":""},{"$f":"IF(ISNUMBER('Gāzbetona bl.'!G29),'Gāzbetona bl.'!G29,\"\")","v":""},{"$f":"IF(ISNUMBER('Gāzbetona bl.'!G29),'Gāzbetona bl.'!H29,\"\")","v":""},{"$f":"IF(ISTEXT('Gāzbetona bl.'!I29),'Gāzbetona bl.'!I29,\"\")","v":""},""]
[{"$f":"IF(ISNUMBER('Gāzbetona bl.'!G30),'Gāzbetona bl.'!A30,\"\")","v":""},{"$f":"IF(ISNUMBER('Gāzbetona bl.'!G30),'Gāzbetona bl.'!B30,\"\")","v":""},{"$f":"IF(ISNUMBER('Gāzbetona bl.'!G30),'Gāzbetona bl.'!C30,\"\")","v":""},{"$f":"IF(ISNUMBER('Gāzbetona bl.'!G30),'Gāzbetona bl.'!E30,\"\")","v":""},{"$f":"IF(ISNUMBER('Gāzbetona bl.'!G30),'Gāzbetona bl.'!G30,\"\")","v":""},{"$f":"IF(ISNUMBER('Gāzbetona bl.'!G30),'Gāzbetona bl.'!H30,\"\")","v":""},{"$f":"IF(ISTEXT('Gāzbetona bl.'!I30),'Gāzbetona bl.'!I30,\"\")","v":""},""]
[{"$f":"IF(ISNUMBER('Gāzbetona bl.'!G31),'Gāzbetona bl.'!A31,\"\")","v":""},{"$f":"IF(ISNUMBER('Gāzbetona bl.'!G31),'Gāzbetona bl.'!B31,\"\")","v":""},{"$f":"IF(ISNUMBER('Gāzbetona bl.'!G31),'Gāzbetona bl.'!C31,\"\")","v":""},{"$f":"IF(ISNUMBER('Gāzbetona bl.'!G31),'Gāzbetona bl.'!E31,\"\")","v":""},{"$f":"IF(ISNUMBER('Gāzbetona bl.'!G31),'Gāzbetona bl.'!G31,\"\")","v":""},{"$f":"IF(ISNUMBER('Gāzbetona bl.'!G31),'Gāzbetona bl.'!H31,\"\")","v":""},{"$f":"IF(ISTEXT('Gāzbetona bl.'!I31),'Gāzbetona bl.'!I31,\"\")","v":""},""]
[{"$f":"IF(ISNUMBER('Gāzbetona bl.'!G32),'Gāzbetona bl.'!A32,\"\")","v":""},{"$f":"IF(ISNUMBER('Gāzbetona bl.'!G32),'Gāzbetona bl.'!B32,\"\")","v":""},{"$f":"IF(ISNUMBER('Gāzbetona bl.'!G32),'Gāzbetona bl.'!C32,\"\")","v":""},{"$f":"IF(ISNUMBER('Gāzbetona bl.'!G32),'Gāzbetona bl.'!E32,\"\")","v":""},{"$f":"IF(ISNUMBER('Gāzbetona bl.'!G32),'Gāzbetona bl.'!G32,\"\")","v":""},{"$f":"IF(ISNUMBER('Gāzbetona bl.'!G32),'Gāzbetona bl.'!H32,\"\")","v":""},{"$f":"IF(ISTEXT('Gāzbetona bl.'!I32),'Gāzbetona bl.'!I32,\"\")","v":""},""]
[{"$f":"IF(ISNUMBER('Gāzbetona bl.'!G33),'Gāzbetona bl.'!A33,\"\")","v":""},{"$f":"IF(ISNUMBER('Gāzbetona bl.'!G33),'Gāzbetona bl.'!B33,\"\")","v":""},{"$f":"IF(ISNUMBER('Gāzbetona bl.'!G33),'Gāzbetona bl.'!C33,\"\")","v":""},{"$f":"IF(ISNUMBER('Gāzbetona bl.'!G33),'Gāzbetona bl.'!E33,\"\")","v":""},{"$f":"IF(ISNUMBER('Gāzbetona bl.'!G33),'Gāzbetona bl.'!G33,\"\")","v":""},{"$f":"IF(ISNUMBER('Gāzbetona bl.'!G33),'Gāzbetona bl.'!H33,\"\")","v":""},{"$f":"IF(ISTEXT('Gāzbetona bl.'!I33),'Gāzbetona bl.'!I33,\"\")","v":""},""]
[{"$f":"IF(ISNUMBER('Gāzbetona bl.'!G34),'Gāzbetona bl.'!A34,\"\")","v":""},{"$f":"IF(ISNUMBER('Gāzbetona bl.'!G34),'Gāzbetona bl.'!B34,\"\")","v":""},{"$f":"IF(ISNUMBER('Gāzbetona bl.'!G34),'Gāzbetona bl.'!C34,\"\")","v":""},{"$f":"IF(ISNUMBER('Gāzbetona bl.'!G34),'Gāzbetona bl.'!E34,\"\")","v":""},{"$f":"IF(ISNUMBER('Gāzbetona bl.'!G34),'Gāzbetona bl.'!G34,\"\")","v":""},{"$f":"IF(ISNUMBER('Gāzbetona bl.'!G34),'Gāzbetona bl.'!H34,\"\")","v":""},{"$f":"IF(ISTEXT('Gāzbetona bl.'!I34),'Gāzbetona bl.'!I34,\"\")","v":""},""]
[{"$f":"IF(ISNUMBER('Gāzbetona bl.'!G35),'Gāzbetona bl.'!A35,\"\")","v":""},{"$f":"IF(ISNUMBER('Gāzbetona bl.'!G35),'Gāzbetona bl.'!B35,\"\")","v":""},{"$f":"IF(ISNUMBER('Gāzbetona bl.'!G35),'Gāzbetona bl.'!C35,\"\")","v":""},{"$f":"IF(ISNUMBER('Gāzbetona bl.'!G35),'Gāzbetona bl.'!E35,\"\")","v":""},{"$f":"IF(ISNUMBER('Gāzbetona bl.'!G35),'Gāzbetona bl.'!G35,\"\")","v":""},{"$f":"IF(ISNUMBER('Gāzbetona bl.'!G35),'Gāzbetona bl.'!H35,\"\")","v":""},{"$f":"IF(ISTEXT('Gāzbetona bl.'!I35),'Gāzbetona bl.'!I35,\"\")","v":""},""]
[{"$f":"IF(ISNUMBER('Gāzbetona bl.'!G36),'Gāzbetona bl.'!A36,\"\")","v":""},{"$f":"IF(ISNUMBER('Gāzbetona bl.'!G36),'Gāzbetona bl.'!B36,\"\")","v":""},{"$f":"IF(ISNUMBER('Gāzbetona bl.'!G36),'Gāzbetona bl.'!C36,\"\")","v":""},{"$f":"IF(ISNUMBER('Gāzbetona bl.'!G36),'Gāzbetona bl.'!E36,\"\")","v":""},{"$f":"IF(ISNUMBER('Gāzbetona bl.'!G36),'Gāzbetona bl.'!G36,\"\")","v":""},{"$f":"IF(ISNUMBER('Gāzbetona bl.'!G36),'Gāzbetona bl.'!H36,\"\")","v":""},{"$f":"IF(ISTEXT('Gāzbetona bl.'!I36),'Gāzbetona bl.'!I36,\"\")","v":""},""]
[{"$f":"IF(ISNUMBER('Gāzbetona bl.'!G37),'Gāzbetona bl.'!A37,\"\")","v":""},{"$f":"IF(ISNUMBER('Gāzbetona bl.'!G37),'Gāzbetona bl.'!B37,\"\")","v":""},{"$f":"IF(ISNUMBER('Gāzbetona bl.'!G37),'Gāzbetona bl.'!C37,\"\")","v":""},{"$f":"IF(ISNUMBER('Gāzbetona bl.'!G37),'Gāzbetona bl.'!E37,\"\")","v":""},{"$f":"IF(ISNUMBER('Gāzbetona bl.'!G37),'Gāzbetona bl.'!G37,\"\")","v":""},{"$f":"IF(ISNUMBER('Gāzbetona bl.'!G37),'Gāzbetona bl.'!H37,\"\")","v":""},{"$f":"IF(ISTEXT('Gāzbetona bl.'!I37),'Gāzbetona bl.'!I37,\"\")","v":""},""]
[{"$f":"IF(ISNUMBER('Gāzbetona bl.'!G38),'Gāzbetona bl.'!A38,\"\")","v":""},{"$f":"IF(ISNUMBER('Gāzbetona bl.'!G38),'Gāzbetona bl.'!B38,\"\")","v":""},{"$f":"IF(ISNUMBER('Gāzbetona bl.'!G38),'Gāzbetona bl.'!C38,\"\")","v":""},{"$f":"IF(ISNUMBER('Gāzbetona bl.'!G38),'Gāzbetona bl.'!E38,\"\")","v":""},{"$f":"IF(ISNUMBER('Gāzbetona bl.'!G38),'Gāzbetona bl.'!G38,\"\")","v":""},{"$f":"IF(ISNUMBER('Gāzbetona bl.'!G38),'Gāzbetona bl.'!H38,\"\")","v":""},{"$f":"IF(ISTEXT('Gāzbetona bl.'!I38),'Gāzbetona bl.'!I38,\"\")","v":""},""]
[{"$f":"IF(ISNUMBER('Gāzbetona bl.'!G39),'Gāzbetona bl.'!A39,\"\")","v":""},{"$f":"IF(ISNUMBER('Gāzbetona bl.'!G39),'Gāzbetona bl.'!B39,\"\")","v":""},{"$f":"IF(ISNUMBER('Gāzbetona bl.'!G39),'Gāzbetona bl.'!C39,\"\")","v":""},{"$f":"IF(ISNUMBER('Gāzbetona bl.'!G39),'Gāzbetona bl.'!E39,\"\")","v":""},{"$f":"IF(ISNUMBER('Gāzbetona bl.'!G39),'Gāzbetona bl.'!G39,\"\")","v":""},{"$f":"IF(ISNUMBER('Gāzbetona bl.'!G39),'Gāzbetona bl.'!H39,\"\")","v":""},{"$f":"IF(ISTEXT('Gāzbetona bl.'!I39),'Gāzbetona bl.'!I39,\"\")","v":""},""]
[{"$f":"IF(ISNUMBER('Gāzbetona bl.'!G40),'Gāzbetona bl.'!A40,\"\")","v":""},{"$f":"IF(ISNUMBER('Gāzbetona bl.'!G40),'Gāzbetona bl.'!B40,\"\")","v":""},{"$f":"IF(ISNUMBER('Gāzbetona bl.'!G40),'Gāzbetona bl.'!C40,\"\")","v":""},{"$f":"IF(ISNUMBER('Gāzbetona bl.'!G40),'Gāzbetona bl.'!E40,\"\")","v":""},{"$f":"IF(ISNUMBER('Gāzbetona bl.'!G40),'Gāzbetona bl.'!G40,\"\")","v":""},{"$f":"IF(ISNUMBER('Gāzbetona bl.'!G40),'Gāzbetona bl.'!H40,\"\")","v":""},{"$f":"IF(ISTEXT('Gāzbetona bl.'!I40),'Gāzbetona bl.'!I40,\"\")","v":""},""]
[{"$f":"IF(ISNUMBER('Gāzbetona bl.'!G41),'Gāzbetona bl.'!A41,\"\")","v":""},{"$f":"IF(ISNUMBER('Gāzbetona bl.'!G41),'Gāzbetona bl.'!B41,\"\")","v":""},{"$f":"IF(ISNUMBER('Gāzbetona bl.'!G41),'Gāzbetona bl.'!C41,\"\")","v":""},{"$f":"IF(ISNUMBER('Gāzbetona bl.'!G41),'Gāzbetona bl.'!E41,\"\")","v":""},{"$f":"IF(ISNUMBER('Gāzbetona bl.'!G41),'Gāzbetona bl.'!G41,\"\")","v":""},{"$f":"IF(ISNUMBER('Gāzbetona bl.'!G41),'Gāzbetona bl.'!H41,\"\")","v":""},{"$f":"IF(ISTEXT('Gāzbetona bl.'!I41),'Gāzbetona bl.'!I41,\"\")","v":""},""]
[{"$f":"IF(ISNUMBER('Gāzbetona bl.'!G42),'Gāzbetona bl.'!A42,\"\")","v":""},{"$f":"IF(ISNUMBER('Gāzbetona bl.'!G42),'Gāzbetona bl.'!B42,\"\")","v":""},{"$f":"IF(ISNUMBER('Gāzbetona bl.'!G42),'Gāzbetona bl.'!C42,\"\")","v":""},{"$f":"IF(ISNUMBER('Gāzbetona bl.'!G42),'Gāzbetona bl.'!E42,\"\")","v":""},{"$f":"IF(ISNUMBER('Gāzbetona bl.'!G42),'Gāzbetona bl.'!G42,\"\")","v":""},{"$f":"IF(ISNUMBER('Gāzbetona bl.'!G42),'Gāzbetona bl.'!H42,\"\")","v":""},{"$f":"IF(ISTEXT('Gāzbetona bl.'!I42),'Gāzbetona bl.'!I42,\"\")","v":""},""]
[{"$f":"IF(ISNUMBER('Gāzbetona bl.'!G43),'Gāzbetona bl.'!A43,\"\")","v":""},{"$f":"IF(ISNUMBER('Gāzbetona bl.'!G43),'Gāzbetona bl.'!B43,\"\")","v":""},{"$f":"IF(ISNUMBER('Gāzbetona bl.'!G43),'Gāzbetona bl.'!C43,\"\")","v":""},{"$f":"IF(ISNUMBER('Gāzbetona bl.'!G43),'Gāzbetona bl.'!E43,\"\")","v":""},{"$f":"IF(ISNUMBER('Gāzbetona bl.'!G43),'Gāzbetona bl.'!G43,\"\")","v":""},{"$f":"IF(ISNUMBER('Gāzbetona bl.'!G43),'Gāzbetona bl.'!H43,\"\")","v":""},{"$f":"IF(ISTEXT('Gāzbetona bl.'!I43),'Gāzbetona bl.'!I43,\"\")","v":""},""]
[{"$f":"IF(ISNUMBER('Gāzbetona bl.'!G44),'Gāzbetona bl.'!A44,\"\")","v":""},{"$f":"IF(ISNUMBER('Gāzbetona bl.'!G44),'Gāzbetona bl.'!B44,\"\")","v":""},{"$f":"IF(ISNUMBER('Gāzbetona bl.'!G44),'Gāzbetona bl.'!C44,\"\")","v":""},{"$f":"IF(ISNUMBER('Gāzbetona bl.'!G44),'Gāzbetona bl.'!E44,\"\")","v":""},{"$f":"IF(ISNUMBER('Gāzbetona bl.'!G44),'Gāzbetona bl.'!G44,\"\")","v":""},{"$f":"IF(ISNUMBER('Gāzbetona bl.'!G44),'Gāzbetona bl.'!H44,\"\")","v":""},{"$f":"IF(ISTEXT('Gāzbetona bl.'!I44),'Gāzbetona bl.'!I44,\"\")","v":""},""]
[{"$f":"IF(ISNUMBER('Gāzbetona bl.'!G45),'Gāzbetona bl.'!A45,\"\")","v":""},{"$f":"IF(ISNUMBER('Gāzbetona bl.'!G45),'Gāzbetona bl.'!B45,\"\")","v":""},{"$f":"IF(ISNUMBER('Gāzbetona bl.'!G45),'Gāzbetona bl.'!C45,\"\")","v":""},{"$f":"IF(ISNUMBER('Gāzbetona bl.'!G45),'Gāzbetona bl.'!E45,\"\")","v":""},{"$f":"IF(ISNUMBER('Gāzbetona bl.'!G45),'Gāzbetona bl.'!G45,\"\")","v":""},{"$f":"IF(ISNUMBER('Gāzbetona bl.'!G45),'Gāzbetona bl.'!H45,\"\")","v":""},{"$f":"IF(ISTEXT('Gāzbetona bl.'!I45),'Gāzbetona bl.'!I45,\"\")","v":""},""]
[]
[{"$f":"IF(ISNUMBER('Keramzītbetona bl.'!G3),'Keramzītbetona bl.'!A3,\"\")","v":""},{"$f":"IF(ISNUMBER('Keramzītbetona bl.'!G3),'Keramzītbetona bl.'!B3,\"\")","v":""},{"$f":"IF(ISNUMBER('Keramzītbetona bl.'!G3),'Keramzītbetona bl.'!C3,\"\")","v":""},{"$f":"IF(ISNUMBER('Keramzītbetona bl.'!G3),'Keramzītbetona bl.'!E3,\"\")","v":""},{"$f":"IF(ISNUMBER('Keramzītbetona bl.'!G3),'Keramzītbetona bl.'!G3,\"\")","v":""},{"$f":"IF(ISNUMBER('Keramzītbetona bl.'!G3),'Keramzītbetona bl.'!H3,\"\")","v":""},{"$f":"IF(ISTEXT('Keramzītbetona bl.'!I3),'Keramzītbetona bl.'!I3,\"\")","v":""},{"$f":"IF(ISNUMBER(E46),\"yes\",\"\")","v":""}]
[{"$f":"IF(ISNUMBER('Keramzītbetona bl.'!G4),'Keramzītbetona bl.'!A4,\"\")","v":""},{"$f":"IF(ISNUMBER('Keramzītbetona bl.'!G4),'Keramzītbetona bl.'!B4,\"\")","v":""},{"$f":"IF(ISNUMBER('Keramzītbetona bl.'!G4),'Keramzītbetona bl.'!C4,\"\")","v":""},{"$f":"IF(ISNUMBER('Keramzītbetona bl.'!G4),'Keramzītbetona bl.'!E4,\"\")","v":""},{"$f":"IF(ISNUMBER('Keramzītbetona bl.'!G4),'Keramzītbetona bl.'!G4,\"\")","v":""},{"$f":"IF(ISNUMBER('Keramzītbetona bl.'!G4),'Keramzītbetona bl.'!H4,\"\")","v":""},{"$f":"IF(ISTEXT('Keramzītbetona bl.'!I4),'Keramzītbetona bl.'!I4,\"\")","v":""},{"$f":"IF(ISNUMBER(E47),\"yes\",\"\")","v":""}]
[{"$f":"IF(ISNUMBER('Keramzītbetona bl.'!G5),'Keramzītbetona bl.'!A5,\"\")","v":""},{"$f":"IF(ISNUMBER('Keramzītbetona bl.'!G5),'Keramzītbetona bl.'!B5,\"\")","v":""},{"$f":"IF(ISNUMBER('Keramzītbetona bl.'!G5),'Keramzītbetona bl.'!C5,\"\")","v":""},{"$f":"IF(ISNUMBER('Keramzītbetona bl.'!G5),'Keramzītbetona bl.'!E5,\"\")","v":""},{"$f":"IF(ISNUMBER('Keramzītbetona bl.'!G5),'Keramzītbetona bl.'!G5,\"\")","v":""},{"$f":"IF(ISNUMBER('Keramzītbetona bl.'!G5),'Keramzītbetona bl.'!H5,\"\")","v":""},{"$f":"IF(ISTEXT('Keramzītbetona bl.'!I5),'Keramzītbetona bl.'!I5,\"\")","v":""},""]
[{"$f":"IF(ISNUMBER('Keramzītbetona bl.'!G6),'Keramzītbetona bl.'!A6,\"\")","v":""},{"$f":"IF(ISNUMBER('Keramzītbetona bl.'!G6),'Keramzītbetona bl.'!B6,\"\")","v":""},{"$f":"IF(ISNUMBER('Keramzītbetona bl.'!G6),'Keramzītbetona bl.'!C6,\"\")","v":""},{"$f":"IF(ISNUMBER('Keramzītbetona bl.'!G6),'Keramzītbetona bl.'!E6,\"\")","v":""},{"$f":"IF(ISNUMBER('Keramzītbetona bl.'!G6),'Keramzītbetona bl.'!G6,\"\")","v":""},{"$f":"IF(ISNUMBER('Keramzītbetona bl.'!G6),'Keramzītbetona bl.'!H6,\"\")","v":""},{"$f":"IF(ISTEXT('Keramzītbetona bl.'!I6),'Keramzītbetona bl.'!I6,\"\")","v":""},""]
[{"$f":"IF(ISNUMBER('Keramzītbetona bl.'!G7),'Keramzītbetona bl.'!A7,\"\")","v":""},{"$f":"IF(ISNUMBER('Keramzītbetona bl.'!G7),'Keramzītbetona bl.'!B7,\"\")","v":""},{"$f":"IF(ISNUMBER('Keramzītbetona bl.'!G7),'Keramzītbetona bl.'!C7,\"\")","v":""},{"$f":"IF(ISNUMBER('Keramzītbetona bl.'!G7),'Keramzītbetona bl.'!E7,\"\")","v":""},{"$f":"IF(ISNUMBER('Keramzītbetona bl.'!G7),'Keramzītbetona bl.'!G7,\"\")","v":""},{"$f":"IF(ISNUMBER('Keramzītbetona bl.'!G7),'Keramzītbetona bl.'!H7,\"\")","v":""},{"$f":"IF(ISTEXT('Keramzītbetona bl.'!I7),'Keramzītbetona bl.'!I7,\"\")","v":""},""]
[{"$f":"IF(ISNUMBER('Keramzītbetona bl.'!G8),'Keramzītbetona bl.'!A8,\"\")","v":""},{"$f":"IF(ISNUMBER('Keramzītbetona bl.'!G8),'Keramzītbetona bl.'!B8,\"\")","v":""},{"$f":"IF(ISNUMBER('Keramzītbetona bl.'!G8),'Keramzītbetona bl.'!C8,\"\")","v":""},{"$f":"IF(ISNUMBER('Keramzītbetona bl.'!G8),'Keramzītbetona bl.'!E8,\"\")","v":""},{"$f":"IF(ISNUMBER('Keramzītbetona bl.'!G8),'Keramzītbetona bl.'!G8,\"\")","v":""},{"$f":"IF(ISNUMBER('Keramzītbetona bl.'!G8),'Keramzītbetona bl.'!H8,\"\")","v":""},{"$f":"IF(ISTEXT('Keramzītbetona bl.'!I8),'Keramzītbetona bl.'!I8,\"\")","v":""},""]
[{"$f":"IF(ISNUMBER('Keramzītbetona bl.'!G9),'Keramzītbetona bl.'!A9,\"\")","v":""},{"$f":"IF(ISNUMBER('Keramzītbetona bl.'!G9),'Keramzītbetona bl.'!B9,\"\")","v":""},{"$f":"IF(ISNUMBER('Keramzītbetona bl.'!G9),'Keramzītbetona bl.'!C9,\"\")","v":""},{"$f":"IF(ISNUMBER('Keramzītbetona bl.'!G9),'Keramzītbetona bl.'!E9,\"\")","v":""},{"$f":"IF(ISNUMBER('Keramzītbetona bl.'!G9),'Keramzītbetona bl.'!G9,\"\")","v":""},{"$f":"IF(ISNUMBER('Keramzītbetona bl.'!G9),'Keramzītbetona bl.'!H9,\"\")","v":""},{"$f":"IF(ISTEXT('Keramzītbetona bl.'!I9),'Keramzītbetona bl.'!I9,\"\")","v":""},""]
[{"$f":"IF(ISNUMBER('Keramzītbetona bl.'!G10),'Keramzītbetona bl.'!A10,\"\")","v":""},{"$f":"IF(ISNUMBER('Keramzītbetona bl.'!G10),'Keramzītbetona bl.'!B10,\"\")","v":""},{"$f":"IF(ISNUMBER('Keramzītbetona bl.'!G10),'Keramzītbetona bl.'!C10,\"\")","v":""},{"$f":"IF(ISNUMBER('Keramzītbetona bl.'!G10),'Keramzītbetona bl.'!E10,\"\")","v":""},{"$f":"IF(ISNUMBER('Keramzītbetona bl.'!G10),'Keramzītbetona bl.'!G10,\"\")","v":""},{"$f":"IF(ISNUMBER('Keramzītbetona bl.'!G10),'Keramzītbetona bl.'!H10,\"\")","v":""},{"$f":"IF(ISTEXT('Keramzītbetona bl.'!I10),'Keramzītbetona bl.'!I10,\"\")","v":""},""]
[{"$f":"IF(ISNUMBER('Keramzītbetona bl.'!G11),'Keramzītbetona bl.'!A11,\"\")","v":""},{"$f":"IF(ISNUMBER('Keramzītbetona bl.'!G11),'Keramzītbetona bl.'!B11,\"\")","v":""},{"$f":"IF(ISNUMBER('Keramzītbetona bl.'!G11),'Keramzītbetona bl.'!C11,\"\")","v":""},{"$f":"IF(ISNUMBER('Keramzītbetona bl.'!G11),'Keramzītbetona bl.'!E11,\"\")","v":""},{"$f":"IF(ISNUMBER('Keramzītbetona bl.'!G11),'Keramzītbetona bl.'!G11,\"\")","v":""},{"$f":"IF(ISNUMBER('Keramzītbetona bl.'!G11),'Keramzītbetona bl.'!H11,\"\")","v":""},{"$f":"IF(ISTEXT('Keramzītbetona bl.'!I11),'Keramzītbetona bl.'!I11,\"\")","v":""},""]
[{"$f":"IF(ISNUMBER('Keramzītbetona bl.'!G12),'Keramzītbetona bl.'!A12,\"\")","v":""},{"$f":"IF(ISNUMBER('Keramzītbetona bl.'!G12),'Keramzītbetona bl.'!B12,\"\")","v":""},{"$f":"IF(ISNUMBER('Keramzītbetona bl.'!G12),'Keramzītbetona bl.'!C12,\"\")","v":""},{"$f":"IF(ISNUMBER('Keramzītbetona bl.'!G12),'Keramzītbetona bl.'!E12,\"\")","v":""},{"$f":"IF(ISNUMBER('Keramzītbetona bl.'!G12),'Keramzītbetona bl.'!G12,\"\")","v":""},{"$f":"IF(ISNUMBER('Keramzītbetona bl.'!G12),'Keramzītbetona bl.'!H12,\"\")","v":""},{"$f":"IF(ISTEXT('Keramzītbetona bl.'!I12),'Keramzītbetona bl.'!I12,\"\")","v":""},""]
[{"$f":"IF(ISNUMBER('Keramzītbetona bl.'!G13),'Keramzītbetona bl.'!A13,\"\")","v":""},{"$f":"IF(ISNUMBER('Keramzītbetona bl.'!G13),'Keramzītbetona bl.'!B13,\"\")","v":""},{"$f":"IF(ISNUMBER('Keramzītbetona bl.'!G13),'Keramzītbetona bl.'!C13,\"\")","v":""},{"$f":"IF(ISNUMBER('Keramzītbetona bl.'!G13),'Keramzītbetona bl.'!E13,\"\")","v":""},{"$f":"IF(ISNUMBER('Keramzītbetona bl.'!G13),'Keramzītbetona bl.'!G13,\"\")","v":""},{"$f":"IF(ISNUMBER('Keramzītbetona bl.'!G13),'Keramzītbetona bl.'!H13,\"\")","v":""},{"$f":"IF(ISTEXT('Keramzītbetona bl.'!I13),'Keramzītbetona bl.'!I13,\"\")","v":""},""]
[{"$f":"IF(ISNUMBER('Keramzītbetona bl.'!G14),'Keramzītbetona bl.'!A14,\"\")","v":""},{"$f":"IF(ISNUMBER('Keramzītbetona bl.'!G14),'Keramzītbetona bl.'!B14,\"\")","v":""},{"$f":"IF(ISNUMBER('Keramzītbetona bl.'!G14),'Keramzītbetona bl.'!C14,\"\")","v":""},{"$f":"IF(ISNUMBER('Keramzītbetona bl.'!G14),'Keramzītbetona bl.'!E14,\"\")","v":""},{"$f":"IF(ISNUMBER('Keramzītbetona bl.'!G14),'Keramzītbetona bl.'!G14,\"\")","v":""},{"$f":"IF(ISNUMBER('Keramzītbetona bl.'!G14),'Keramzītbetona bl.'!H14,\"\")","v":""},{"$f":"IF(ISTEXT('Keramzītbetona bl.'!I14),'Keramzītbetona bl.'!I14,\"\")","v":""},""]
[{"$f":"IF(ISNUMBER('Keramzītbetona bl.'!G15),'Keramzītbetona bl.'!A15,\"\")","v":""},{"$f":"IF(ISNUMBER('Keramzītbetona bl.'!G15),'Keramzītbetona bl.'!B15,\"\")","v":""},{"$f":"IF(ISNUMBER('Keramzītbetona bl.'!G15),'Keramzītbetona bl.'!C15,\"\")","v":""},{"$f":"IF(ISNUMBER('Keramzītbetona bl.'!G15),'Keramzītbetona bl.'!E15,\"\")","v":""},{"$f":"IF(ISNUMBER('Keramzītbetona bl.'!G15),'Keramzītbetona bl.'!G15,\"\")","v":""},{"$f":"IF(ISNUMBER('Keramzītbetona bl.'!G15),'Keramzītbetona bl.'!H15,\"\")","v":""},{"$f":"IF(ISTEXT('Keramzītbetona bl.'!I15),'Keramzītbetona bl.'!I15,\"\")","v":""},""]
[{"$f":"IF(ISNUMBER('Keramzītbetona bl.'!G16),'Keramzītbetona bl.'!A16,\"\")","v":""},{"$f":"IF(ISNUMBER('Keramzītbetona bl.'!G16),'Keramzītbetona bl.'!B16,\"\")","v":""},{"$f":"IF(ISNUMBER('Keramzītbetona bl.'!G16),'Keramzītbetona bl.'!C16,\"\")","v":""},{"$f":"IF(ISNUMBER('Keramzītbetona bl.'!G16),'Keramzītbetona bl.'!E16,\"\")","v":""},{"$f":"IF(ISNUMBER('Keramzītbetona bl.'!G16),'Keramzītbetona bl.'!G16,\"\")","v":""},{"$f":"IF(ISNUMBER('Keramzītbetona bl.'!G16),'Keramzītbetona bl.'!H16,\"\")","v":""},{"$f":"IF(ISTEXT('Keramzītbetona bl.'!I16),'Keramzītbetona bl.'!I16,\"\")","v":""},""]
[{"$f":"IF(ISNUMBER('Keramzītbetona bl.'!G17),'Keramzītbetona bl.'!A17,\"\")","v":""},{"$f":"IF(ISNUMBER('Keramzītbetona bl.'!G17),'Keramzītbetona bl.'!B17,\"\")","v":""},{"$f":"IF(ISNUMBER('Keramzītbetona bl.'!G17),'Keramzītbetona bl.'!C17,\"\")","v":""},{"$f":"IF(ISNUMBER('Keramzītbetona bl.'!G17),'Keramzītbetona bl.'!E17,\"\")","v":""},{"$f":"IF(ISNUMBER('Keramzītbetona bl.'!G17),'Keramzītbetona bl.'!G17,\"\")","v":""},{"$f":"IF(ISNUMBER('Keramzītbetona bl.'!G17),'Keramzītbetona bl.'!H17,\"\")","v":""},{"$f":"IF(ISTEXT('Keramzītbetona bl.'!I17),'Keramzītbetona bl.'!I17,\"\")","v":""},""]
[{"$f":"IF(ISNUMBER('Keramzītbetona bl.'!G18),'Keramzītbetona bl.'!A18,\"\")","v":""},{"$f":"IF(ISNUMBER('Keramzītbetona bl.'!G18),'Keramzītbetona bl.'!B18,\"\")","v":""},{"$f":"IF(ISNUMBER('Keramzītbetona bl.'!G18),'Keramzītbetona bl.'!C18,\"\")","v":""},{"$f":"IF(ISNUMBER('Keramzītbetona bl.'!G18),'Keramzītbetona bl.'!E18,\"\")","v":""},{"$f":"IF(ISNUMBER('Keramzītbetona bl.'!G18),'Keramzītbetona bl.'!G18,\"\")","v":""},{"$f":"IF(ISNUMBER('Keramzītbetona bl.'!G18),'Keramzītbetona bl.'!H18,\"\")","v":""},{"$f":"IF(ISTEXT('Keramzītbetona bl.'!I18),'Keramzītbetona bl.'!I18,\"\")","v":""},""]
[{"$f":"IF(ISNUMBER('Keramzītbetona bl.'!G19),'Keramzītbetona bl.'!A19,\"\")","v":""},{"$f":"IF(ISNUMBER('Keramzītbetona bl.'!G19),'Keramzītbetona bl.'!B19,\"\")","v":""},{"$f":"IF(ISNUMBER('Keramzītbetona bl.'!G19),'Keramzītbetona bl.'!C19,\"\")","v":""},{"$f":"IF(ISNUMBER('Keramzītbetona bl.'!G19),'Keramzītbetona bl.'!E19,\"\")","v":""},{"$f":"IF(ISNUMBER('Keramzītbetona bl.'!G19),'Keramzītbetona bl.'!G19,\"\")","v":""},{"$f":"IF(ISNUMBER('Keramzītbetona bl.'!G19),'Keramzītbetona bl.'!H19,\"\")","v":""},{"$f":"IF(ISTEXT('Keramzītbetona bl.'!I19),'Keramzītbetona bl.'!I19,\"\")","v":""},""]
[{"$f":"IF(ISNUMBER('Keramzītbetona bl.'!G20),'Keramzītbetona bl.'!A20,\"\")","v":""},{"$f":"IF(ISNUMBER('Keramzītbetona bl.'!G20),'Keramzītbetona bl.'!B20,\"\")","v":""},{"$f":"IF(ISNUMBER('Keramzītbetona bl.'!G20),'Keramzītbetona bl.'!C20,\"\")","v":""},{"$f":"IF(ISNUMBER('Keramzītbetona bl.'!G20),'Keramzītbetona bl.'!E20,\"\")","v":""},{"$f":"IF(ISNUMBER('Keramzītbetona bl.'!G20),'Keramzītbetona bl.'!G20,\"\")","v":""},{"$f":"IF(ISNUMBER('Keramzītbetona bl.'!G20),'Keramzītbetona bl.'!H20,\"\")","v":""},{"$f":"IF(ISTEXT('Keramzītbetona bl.'!I20),'Keramzītbetona bl.'!I20,\"\")","v":""},""]
[{"$f":"IF(ISNUMBER('Keramzītbetona bl.'!G21),'Keramzītbetona bl.'!A21,\"\")","v":""},{"$f":"IF(ISNUMBER('Keramzītbetona bl.'!G21),'Keramzītbetona bl.'!B21,\"\")","v":""},{"$f":"IF(ISNUMBER('Keramzītbetona bl.'!G21),'Keramzītbetona bl.'!C21,\"\")","v":""},{"$f":"IF(ISNUMBER('Keramzītbetona bl.'!G21),'Keramzītbetona bl.'!E21,\"\")","v":""},{"$f":"IF(ISNUMBER('Keramzītbetona bl.'!G21),'Keramzītbetona bl.'!G21,\"\")","v":""},{"$f":"IF(ISNUMBER('Keramzītbetona bl.'!G21),'Keramzītbetona bl.'!H21,\"\")","v":""},{"$f":"IF(ISTEXT('Keramzītbetona bl.'!I21),'Keramzītbetona bl.'!I21,\"\")","v":""},""]
[{"$f":"IF(ISNUMBER('Keramzītbetona bl.'!G22),'Keramzītbetona bl.'!A22,\"\")","v":""},{"$f":"IF(ISNUMBER('Keramzītbetona bl.'!G22),'Keramzītbetona bl.'!B22,\"\")","v":""},{"$f":"IF(ISNUMBER('Keramzītbetona bl.'!G22),'Keramzītbetona bl.'!C22,\"\")","v":""},{"$f":"IF(ISNUMBER('Keramzītbetona bl.'!G22),'Keramzītbetona bl.'!E22,\"\")","v":""},{"$f":"IF(ISNUMBER('Keramzītbetona bl.'!G22),'Keramzītbetona bl.'!G22,\"\")","v":""},{"$f":"IF(ISNUMBER('Keramzītbetona bl.'!G22),'Keramzītbetona bl.'!H22,\"\")","v":""},{"$f":"IF(ISTEXT('Keramzītbetona bl.'!I22),'Keramzītbetona bl.'!I22,\"\")","v":""},""]
[{"$f":"IF(ISNUMBER('Keramzītbetona bl.'!G23),'Keramzītbetona bl.'!A23,\"\")","v":""},{"$f":"IF(ISNUMBER('Keramzītbetona bl.'!G23),'Keramzītbetona bl.'!B23,\"\")","v":""},{"$f":"IF(ISNUMBER('Keramzītbetona bl.'!G23),'Keramzītbetona bl.'!C23,\"\")","v":""},{"$f":"IF(ISNUMBER('Keramzītbetona bl.'!G23),'Keramzītbetona bl.'!E23,\"\")","v":""},{"$f":"IF(ISNUMBER('Keramzītbetona bl.'!G23),'Keramzītbetona bl.'!G23,\"\")","v":""},{"$f":"IF(ISNUMBER('Keramzītbetona bl.'!G23),'Keramzītbetona bl.'!H23,\"\")","v":""},{"$f":"IF(ISTEXT('Keramzītbetona bl.'!I23),'Keramzītbetona bl.'!I23,\"\")","v":""},""]
[{"$f":"IF(ISNUMBER('Keramzītbetona bl.'!G24),'Keramzītbetona bl.'!A24,\"\")","v":""},{"$f":"IF(ISNUMBER('Keramzītbetona bl.'!G24),'Keramzītbetona bl.'!B24,\"\")","v":""},{"$f":"IF(ISNUMBER('Keramzītbetona bl.'!G24),'Keramzītbetona bl.'!C24,\"\")","v":""},{"$f":"IF(ISNUMBER('Keramzītbetona bl.'!G24),'Keramzītbetona bl.'!E24,\"\")","v":""},{"$f":"IF(ISNUMBER('Keramzītbetona bl.'!G24),'Keramzītbetona bl.'!G24,\"\")","v":""},{"$f":"IF(ISNUMBER('Keramzītbetona bl.'!G24),'Keramzītbetona bl.'!H24,\"\")","v":""},{"$f":"IF(ISTEXT('Keramzītbetona bl.'!I24),'Keramzītbetona bl.'!I24,\"\")","v":""},""]
[{"$f":"IF(ISNUMBER('Keramzītbetona bl.'!G25),'Keramzītbetona bl.'!A25,\"\")","v":""},{"$f":"IF(ISNUMBER('Keramzītbetona bl.'!G25),'Keramzītbetona bl.'!B25,\"\")","v":""},{"$f":"IF(ISNUMBER('Keramzītbetona bl.'!G25),'Keramzītbetona bl.'!C25,\"\")","v":""},{"$f":"IF(ISNUMBER('Keramzītbetona bl.'!G25),'Keramzītbetona bl.'!E25,\"\")","v":""},{"$f":"IF(ISNUMBER('Keramzītbetona bl.'!G25),'Keramzītbetona bl.'!G25,\"\")","v":""},{"$f":"IF(ISNUMBER('Keramzītbetona bl.'!G25),'Keramzītbetona bl.'!H25,\"\")","v":""},{"$f":"IF(ISTEXT('Keramzītbetona bl.'!I25),'Keramzītbetona bl.'!I25,\"\")","v":""},""]
[{"$f":"IF(ISNUMBER('Keramzītbetona bl.'!G26),'Keramzītbetona bl.'!A26,\"\")","v":""},{"$f":"IF(ISNUMBER('Keramzītbetona bl.'!G26),'Keramzītbetona bl.'!B26,\"\")","v":""},{"$f":"IF(ISNUMBER('Keramzītbetona bl.'!G26),'Keramzītbetona bl.'!C26,\"\")","v":""},{"$f":"IF(ISNUMBER('Keramzītbetona bl.'!G26),'Keramzītbetona bl.'!E26,\"\")","v":""},{"$f":"IF(ISNUMBER('Keramzītbetona bl.'!G26),'Keramzītbetona bl.'!G26,\"\")","v":""},{"$f":"IF(ISNUMBER('Keramzītbetona bl.'!G26),'Keramzītbetona bl.'!H26,\"\")","v":""},{"$f":"IF(ISTEXT('Keramzītbetona bl.'!I26),'Keramzītbetona bl.'!I26,\"\")","v":""},""]
[{"$f":"IF(ISNUMBER('Keramzītbetona bl.'!G27),'Keramzītbetona bl.'!A27,\"\")","v":""},{"$f":"IF(ISNUMBER('Keramzītbetona bl.'!G27),'Keramzītbetona bl.'!B27,\"\")","v":""},{"$f":"IF(ISNUMBER('Keramzītbetona bl.'!G27),'Keramzītbetona bl.'!C27,\"\")","v":""},{"$f":"IF(ISNUMBER('Keramzītbetona bl.'!G27),'Keramzītbetona bl.'!E27,\"\")","v":""},{"$f":"IF(ISNUMBER('Keramzītbetona bl.'!G27),'Keramzītbetona bl.'!G27,\"\")","v":""},{"$f":"IF(ISNUMBER('Keramzītbetona bl.'!G27),'Keramzītbetona bl.'!H27,\"\")","v":""},{"$f":"IF(ISTEXT('Keramzītbetona bl.'!I27),'Keramzītbetona bl.'!I27,\"\")","v":""},""]
[{"$f":"IF(ISNUMBER('Keramzītbetona bl.'!G28),'Keramzītbetona bl.'!A28,\"\")","v":""},{"$f":"IF(ISNUMBER('Keramzītbetona bl.'!G28),'Keramzītbetona bl.'!B28,\"\")","v":""},{"$f":"IF(ISNUMBER('Keramzītbetona bl.'!G28),'Keramzītbetona bl.'!C28,\"\")","v":""},{"$f":"IF(ISNUMBER('Keramzītbetona bl.'!G28),'Keramzītbetona bl.'!E28,\"\")","v":""},{"$f":"IF(ISNUMBER('Keramzītbetona bl.'!G28),'Keramzītbetona bl.'!G28,\"\")","v":""},{"$f":"IF(ISNUMBER('Keramzītbetona bl.'!G28),'Keramzītbetona bl.'!H28,\"\")","v":""},{"$f":"IF(ISTEXT('Keramzītbetona bl.'!I28),'Keramzītbetona bl.'!I28,\"\")","v":""},""]
[{"$f":"IF(ISNUMBER('Keramzītbetona bl.'!G29),'Keramzītbetona bl.'!A29,\"\")","v":""},{"$f":"IF(ISNUMBER('Keramzītbetona bl.'!G29),'Keramzītbetona bl.'!B29,\"\")","v":""},{"$f":"IF(ISNUMBER('Keramzītbetona bl.'!G29),'Keramzītbetona bl.'!C29,\"\")","v":""},{"$f":"IF(ISNUMBER('Keramzītbetona bl.'!G29),'Keramzītbetona bl.'!E29,\"\")","v":""},{"$f":"IF(ISNUMBER('Keramzītbetona bl.'!G29),'Keramzītbetona bl.'!G29,\"\")","v":""},{"$f":"IF(ISNUMBER('Keramzītbetona bl.'!G29),'Keramzītbetona bl.'!H29,\"\")","v":""},{"$f":"IF(ISTEXT('Keramzītbetona bl.'!I29),'Keramzītbetona bl.'!I29,\"\")","v":""},""]
[{"$f":"IF(ISNUMBER('Keramzītbetona bl.'!G30),'Keramzītbetona bl.'!A30,\"\")","v":""},{"$f":"IF(ISNUMBER('Keramzītbetona bl.'!G30),'Keramzītbetona bl.'!B30,\"\")","v":""},{"$f":"IF(ISNUMBER('Keramzītbetona bl.'!G30),'Keramzītbetona bl.'!C30,\"\")","v":""},{"$f":"IF(ISNUMBER('Keramzītbetona bl.'!G30),'Keramzītbetona bl.'!E30,\"\")","v":""},{"$f":"IF(ISNUMBER('Keramzītbetona bl.'!G30),'Keramzītbetona bl.'!G30,\"\")","v":""},{"$f":"IF(ISNUMBER('Keramzītbetona bl.'!G30),'Keramzītbetona bl.'!H30,\"\")","v":""},{"$f":"IF(ISTEXT('Keramzītbetona bl.'!I30),'Keramzītbetona bl.'!I30,\"\")","v":""},""]
[{"$f":"IF(ISNUMBER('Keramzītbetona bl.'!G31),'Keramzītbetona bl.'!A31,\"\")","v":""},{"$f":"IF(ISNUMBER('Keramzītbetona bl.'!G31),'Keramzītbetona bl.'!B31,\"\")","v":""},{"$f":"IF(ISNUMBER('Keramzītbetona bl.'!G31),'Keramzītbetona bl.'!C31,\"\")","v":""},{"$f":"IF(ISNUMBER('Keramzītbetona bl.'!G31),'Keramzītbetona bl.'!E31,\"\")","v":""},{"$f":"IF(ISNUMBER('Keramzītbetona bl.'!G31),'Keramzītbetona bl.'!G31,\"\")","v":""},{"$f":"IF(ISNUMBER('Keramzītbetona bl.'!G31),'Keramzītbetona bl.'!H31,\"\")","v":""},{"$f":"IF(ISTEXT('Keramzītbetona bl.'!I31),'Keramzītbetona bl.'!I31,\"\")","v":""},""]
[{"$f":"IF(ISNUMBER('Keramzītbetona bl.'!G32),'Keramzītbetona bl.'!A32,\"\")","v":""},{"$f":"IF(ISNUMBER('Keramzītbetona bl.'!G32),'Keramzītbetona bl.'!B32,\"\")","v":""},{"$f":"IF(ISNUMBER('Keramzītbetona bl.'!G32),'Keramzītbetona bl.'!C32,\"\")","v":""},{"$f":"IF(ISNUMBER('Keramzītbetona bl.'!G32),'Keramzītbetona bl.'!E32,\"\")","v":""},{"$f":"IF(ISNUMBER('Keramzītbetona bl.'!G32),'Keramzītbetona bl.'!G32,\"\")","v":""},{"$f":"IF(ISNUMBER('Keramzītbetona bl.'!G32),'Keramzītbetona bl.'!H32,\"\")","v":""},{"$f":"IF(ISTEXT('Keramzītbetona bl.'!I32),'Keramzītbetona bl.'!I32,\"\")","v":""},""]
[{"$f":"IF(ISNUMBER('Keramzītbetona bl.'!G33),'Keramzītbetona bl.'!A33,\"\")","v":""},{"$f":"IF(ISNUMBER('Keramzītbetona bl.'!G33),'Keramzītbetona bl.'!B33,\"\")","v":""},{"$f":"IF(ISNUMBER('Keramzītbetona bl.'!G33),'Keramzītbetona bl.'!C33,\"\")","v":""},{"$f":"IF(ISNUMBER('Keramzītbetona bl.'!G33),'Keramzītbetona bl.'!E33,\"\")","v":""},{"$f":"IF(ISNUMBER('Keramzītbetona bl.'!G33),'Keramzītbetona bl.'!G33,\"\")","v":""},{"$f":"IF(ISNUMBER('Keramzītbetona bl.'!G33),'Keramzītbetona bl.'!H33,\"\")","v":""},{"$f":"IF(ISTEXT('Keramzītbetona bl.'!I33),'Keramzītbetona bl.'!I33,\"\")","v":""},""]
[{"$f":"IF(ISNUMBER('Keramzītbetona bl.'!G34),'Keramzītbetona bl.'!A34,\"\")","v":""},{"$f":"IF(ISNUMBER('Keramzītbetona bl.'!G34),'Keramzītbetona bl.'!B34,\"\")","v":""},{"$f":"IF(ISNUMBER('Keramzītbetona bl.'!G34),'Keramzītbetona bl.'!C34,\"\")","v":""},{"$f":"IF(ISNUMBER('Keramzītbetona bl.'!G34),'Keramzītbetona bl.'!E34,\"\")","v":""},{"$f":"IF(ISNUMBER('Keramzītbetona bl.'!G34),'Keramzītbetona bl.'!G34,\"\")","v":""},{"$f":"IF(ISNUMBER('Keramzītbetona bl.'!G34),'Keramzītbetona bl.'!H34,\"\")","v":""},{"$f":"IF(ISTEXT('Keramzītbetona bl.'!I34),'Keramzītbetona bl.'!I34,\"\")","v":""},""]
[{"$f":"IF(ISNUMBER('Keramzītbetona bl.'!G35),'Keramzītbetona bl.'!A35,\"\")","v":""},{"$f":"IF(ISNUMBER('Keramzītbetona bl.'!G35),'Keramzītbetona bl.'!B35,\"\")","v":""},{"$f":"IF(ISNUMBER('Keramzītbetona bl.'!G35),'Keramzītbetona bl.'!C35,\"\")","v":""},{"$f":"IF(ISNUMBER('Keramzītbetona bl.'!G35),'Keramzītbetona bl.'!E35,\"\")","v":""},{"$f":"IF(ISNUMBER('Keramzītbetona bl.'!G35),'Keramzītbetona bl.'!G35,\"\")","v":""},{"$f":"IF(ISNUMBER('Keramzītbetona bl.'!G35),'Keramzītbetona bl.'!H35,\"\")","v":""},{"$f":"IF(ISTEXT('Keramzītbetona bl.'!I35),'Keramzītbetona bl.'!I35,\"\")","v":""},""]
[{"$f":"IF(ISNUMBER('Keramzītbetona bl.'!G36),'Keramzītbetona bl.'!A36,\"\")","v":""},{"$f":"IF(ISNUMBER('Keramzītbetona bl.'!G36),'Keramzītbetona bl.'!B36,\"\")","v":""},{"$f":"IF(ISNUMBER('Keramzītbetona bl.'!G36),'Keramzītbetona bl.'!C36,\"\")","v":""},{"$f":"IF(ISNUMBER('Keramzītbetona bl.'!G36),'Keramzītbetona bl.'!E36,\"\")","v":""},{"$f":"IF(ISNUMBER('Keramzītbetona bl.'!G36),'Keramzītbetona bl.'!G36,\"\")","v":""},{"$f":"IF(ISNUMBER('Keramzītbetona bl.'!G36),'Keramzītbetona bl.'!H36,\"\")","v":""},{"$f":"IF(ISTEXT('Keramzītbetona bl.'!I36),'Keramzītbetona bl.'!I36,\"\")","v":""},""]
[{"$f":"IF(ISNUMBER('Keramzītbetona bl.'!G37),'Keramzītbetona bl.'!A37,\"\")","v":""},{"$f":"IF(ISNUMBER('Keramzītbetona bl.'!G37),'Keramzītbetona bl.'!B37,\"\")","v":""},{"$f":"IF(ISNUMBER('Keramzītbetona bl.'!G37),'Keramzītbetona bl.'!C37,\"\")","v":""},{"$f":"IF(ISNUMBER('Keramzītbetona bl.'!G37),'Keramzītbetona bl.'!E37,\"\")","v":""},{"$f":"IF(ISNUMBER('Keramzītbetona bl.'!G37),'Keramzītbetona bl.'!G37,\"\")","v":""},{"$f":"IF(ISNUMBER('Keramzītbetona bl.'!G37),'Keramzītbetona bl.'!H37,\"\")","v":""},{"$f":"IF(ISTEXT('Keramzītbetona bl.'!I37),'Keramzītbetona bl.'!I37,\"\")","v":""},{"$f":"IF(ISNUMBER(E80),\"yes\",\"\")","v":""}]
[{"$f":"IF(ISNUMBER('Keramzītbetona bl.'!G38),'Keramzītbetona bl.'!A38,\"\")","v":""},{"$f":"IF(ISNUMBER('Keramzītbetona bl.'!G38),'Keramzītbetona bl.'!B38,\"\")","v":""},{"$f":"IF(ISNUMBER('Keramzītbetona bl.'!G38),'Keramzītbetona bl.'!C38,\"\")","v":""},{"$f":"IF(ISNUMBER('Keramzītbetona bl.'!G39),'Keramzītbetona bl.'!F39,\"\")","v":""},{"$f":"IF(ISNUMBER('Keramzītbetona bl.'!G38),'Keramzītbetona bl.'!G38,\"\")","v":""},{"$f":"IF(ISNUMBER('Keramzītbetona bl.'!G38),'Keramzītbetona bl.'!H38,\"\")","v":""},{"$f":"IF(ISTEXT('Keramzītbetona bl.'!I38),'Keramzītbetona bl.'!I38,\"\")","v":""},""]
[]
[{"$f":"IF(ISNUMBER('Inertie mat.'!E4),'Inertie mat.'!A4,\"\")","v":""},{"$f":"IF(ISNUMBER('Inertie mat.'!E4),'Inertie mat.'!B4,\"\")","v":""},{"$f":"IF(ISNUMBER('Inertie mat.'!E4),'Inertie mat.'!C4,\"\")","v":""},{"$f":"IF(ISNUMBER('Inertie mat.'!E4),'Inertie mat.'!D4,\"\")","v":""},{"$f":"IF(ISNUMBER('Inertie mat.'!E4),'Inertie mat.'!E4,\"\")","v":""},{"$f":"IF(ISNUMBER('Inertie mat.'!E4),'Inertie mat.'!F4,\"\")","v":""},{"$f":"IF(ISTEXT('Inertie mat.'!G4),'Inertie mat.'!G4,\"\")","v":""},""]
[{"$f":"IF(ISNUMBER('Inertie mat.'!E5),'Inertie mat.'!A5,\"\")","v":""},{"$f":"IF(ISNUMBER('Inertie mat.'!E5),'Inertie mat.'!B5,\"\")","v":""},{"$f":"IF(ISNUMBER('Inertie mat.'!E5),'Inertie mat.'!C5,\"\")","v":""},{"$f":"IF(ISNUMBER('Inertie mat.'!E5),'Inertie mat.'!D5,\"\")","v":""},{"$f":"IF(ISNUMBER('Inertie mat.'!E5),'Inertie mat.'!E5,\"\")","v":""},{"$f":"IF(ISNUMBER('Inertie mat.'!E5),'Inertie mat.'!F5,\"\")","v":""},{"$f":"IF(ISTEXT('Inertie mat.'!G5),'Inertie mat.'!G5,\"\")","v":""},""]
[{"$f":"IF(ISNUMBER('Inertie mat.'!E6),'Inertie mat.'!A6,\"\")","v":""},{"$f":"IF(ISNUMBER('Inertie mat.'!E6),'Inertie mat.'!B6,\"\")","v":""},{"$f":"IF(ISNUMBER('Inertie mat.'!E6),'Inertie mat.'!C6,\"\")","v":""},{"$f":"IF(ISNUMBER('Inertie mat.'!E6),'Inertie mat.'!D6,\"\")","v":""},{"$f":"IF(ISNUMBER('Inertie mat.'!E6),'Inertie mat.'!E6,\"\")","v":""},{"$f":"IF(ISNUMBER('Inertie mat.'!E6),'Inertie mat.'!F6,\"\")","v":""},{"$f":"IF(ISTEXT('Inertie mat.'!G6),'Inertie mat.'!G6,\"\")","v":""},""]
[{"$f":"IF(ISNUMBER('Inertie mat.'!E7),'Inertie mat.'!A7,\"\")","v":""},{"$f":"IF(ISNUMBER('Inertie mat.'!E7),'Inertie mat.'!B7,\"\")","v":""},{"$f":"IF(ISNUMBER('Inertie mat.'!E7),'Inertie mat.'!C7,\"\")","v":""},{"$f":"IF(ISNUMBER('Inertie mat.'!E7),'Inertie mat.'!D7,\"\")","v":""},{"$f":"IF(ISNUMBER('Inertie mat.'!E7),'Inertie mat.'!E7,\"\")","v":""},{"$f":"IF(ISNUMBER('Inertie mat.'!E7),'Inertie mat.'!F7,\"\")","v":""},{"$f":"IF(ISTEXT('Inertie mat.'!G7),'Inertie mat.'!G7,\"\")","v":""},""]
[{"$f":"IF(ISNUMBER('Inertie mat.'!E8),'Inertie mat.'!A8,\"\")","v":""},{"$f":"IF(ISNUMBER('Inertie mat.'!E8),'Inertie mat.'!B8,\"\")","v":""},{"$f":"IF(ISNUMBER('Inertie mat.'!E8),'Inertie mat.'!C8,\"\")","v":""},{"$f":"IF(ISNUMBER('Inertie mat.'!E8),'Inertie mat.'!D8,\"\")","v":""},{"$f":"IF(ISNUMBER('Inertie mat.'!E8),'Inertie mat.'!E8,\"\")","v":""},{"$f":"IF(ISNUMBER('Inertie mat.'!E8),'Inertie mat.'!F8,\"\")","v":""},{"$f":"IF(ISTEXT('Inertie mat.'!G8),'Inertie mat.'!G8,\"\")","v":""},""]
[{"$f":"IF(ISNUMBER('Inertie mat.'!E9),'Inertie mat.'!A9,\"\")","v":""},{"$f":"IF(ISNUMBER('Inertie mat.'!E9),'Inertie mat.'!B9,\"\")","v":""},{"$f":"IF(ISNUMBER('Inertie mat.'!E9),'Inertie mat.'!C9,\"\")","v":""},{"$f":"IF(ISNUMBER('Inertie mat.'!E9),'Inertie mat.'!D9,\"\")","v":""},{"$f":"IF(ISNUMBER('Inertie mat.'!E9),'Inertie mat.'!E9,\"\")","v":""},{"$f":"IF(ISNUMBER('Inertie mat.'!E9),'Inertie mat.'!F9,\"\")","v":""},{"$f":"IF(ISTEXT('Inertie mat.'!G9),'Inertie mat.'!G9,\"\")","v":""},""]
[{"$f":"IF(ISNUMBER('Inertie mat.'!E10),'Inertie mat.'!A10,\"\")","v":""},{"$f":"IF(ISNUMBER('Inertie mat.'!E10),'Inertie mat.'!B10,\"\")","v":""},{"$f":"IF(ISNUMBER('Inertie mat.'!E10),'Inertie mat.'!C10,\"\")","v":""},{"$f":"IF(ISNUMBER('Inertie mat.'!E10),'Inertie mat.'!D10,\"\")","v":""},{"$f":"IF(ISNUMBER('Inertie mat.'!E10),'Inertie mat.'!E10,\"\")","v":""},{"$f":"IF(ISNUMBER('Inertie mat.'!E10),'Inertie mat.'!F10,\"\")","v":""},{"$f":"IF(ISTEXT('Inertie mat.'!G10),'Inertie mat.'!G10,\"\")","v":""},""]
[{"$f":"IF(ISNUMBER('Inertie mat.'!E11),'Inertie mat.'!A11,\"\")","v":""},{"$f":"IF(ISNUMBER('Inertie mat.'!E11),'Inertie mat.'!B11,\"\")","v":""},{"$f":"IF(ISNUMBER('Inertie mat.'!E11),'Inertie mat.'!C11,\"\")","v":""},{"$f":"IF(ISNUMBER('Inertie mat.'!E11),'Inertie mat.'!D11,\"\")","v":""},{"$f":"IF(ISNUMBER('Inertie mat.'!E11),'Inertie mat.'!E11,\"\")","v":""},{"$f":"IF(ISNUMBER('Inertie mat.'!E11),'Inertie mat.'!F11,\"\")","v":""},{"$f":"IF(ISTEXT('Inertie mat.'!G11),'Inertie mat.'!G11,\"\")","v":""},""]
[{"$f":"IF(ISNUMBER('Inertie mat.'!E12),'Inertie mat.'!A12,\"\")","v":""},{"$f":"IF(ISNUMBER('Inertie mat.'!E12),'Inertie mat.'!B12,\"\")","v":""},{"$f":"IF(ISNUMBER('Inertie mat.'!E12),'Inertie mat.'!C12,\"\")","v":""},{"$f":"IF(ISNUMBER('Inertie mat.'!E12),'Inertie mat.'!D12,\"\")","v":""},{"$f":"IF(ISNUMBER('Inertie mat.'!E12),'Inertie mat.'!E12,\"\")","v":""},{"$f":"IF(ISNUMBER('Inertie mat.'!E12),'Inertie mat.'!F12,\"\")","v":""},{"$f":"IF(ISTEXT('Inertie mat.'!G12),'Inertie mat.'!G12,\"\")","v":""},""]
[{"$f":"IF(ISNUMBER('Inertie mat.'!E13),'Inertie mat.'!A13,\"\")","v":""},{"$f":"IF(ISNUMBER('Inertie mat.'!E13),'Inertie mat.'!B13,\"\")","v":""},{"$f":"IF(ISNUMBER('Inertie mat.'!E13),'Inertie mat.'!C13,\"\")","v":""},{"$f":"IF(ISNUMBER('Inertie mat.'!E13),'Inertie mat.'!D13,\"\")","v":""},{"$f":"IF(ISNUMBER('Inertie mat.'!E13),'Inertie mat.'!E13,\"\")","v":""},{"$f":"IF(ISNUMBER('Inertie mat.'!E13),'Inertie mat.'!F13,\"\")","v":""},{"$f":"IF(ISTEXT('Inertie mat.'!G13),'Inertie mat.'!G13,\"\")","v":""},""]
[{"$f":"IF(ISNUMBER('Inertie mat.'!E14),'Inertie mat.'!A14,\"\")","v":""},{"$f":"IF(ISNUMBER('Inertie mat.'!E14),'Inertie mat.'!B14,\"\")","v":""},{"$f":"IF(ISNUMBER('Inertie mat.'!E14),'Inertie mat.'!C14,\"\")","v":""},{"$f":"IF(ISNUMBER('Inertie mat.'!E14),'Inertie mat.'!D14,\"\")","v":""},{"$f":"IF(ISNUMBER('Inertie mat.'!E14),'Inertie mat.'!E14,\"\")","v":""},{"$f":"IF(ISNUMBER('Inertie mat.'!E14),'Inertie mat.'!F14,\"\")","v":""},{"$f":"IF(ISTEXT('Inertie mat.'!G14),'Inertie mat.'!G14,\"\")","v":""},""]
[{"$f":"IF(ISNUMBER('Inertie mat.'!E15),'Inertie mat.'!A15,\"\")","v":""},{"$f":"IF(ISNUMBER('Inertie mat.'!E15),'Inertie mat.'!B15,\"\")","v":""},{"$f":"IF(ISNUMBER('Inertie mat.'!E15),'Inertie mat.'!C15,\"\")","v":""},{"$f":"IF(ISNUMBER('Inertie mat.'!E15),'Inertie mat.'!D15,\"\")","v":""},{"$f":"IF(ISNUMBER('Inertie mat.'!E15),'Inertie mat.'!E15,\"\")","v":""},{"$f":"IF(ISNUMBER('Inertie mat.'!E15),'Inertie mat.'!F15,\"\")","v":""},{"$f":"IF(ISTEXT('Inertie mat.'!G15),'Inertie mat.'!G15,\"\")","v":""},""]
[{"$f":"IF(ISNUMBER('Inertie mat.'!E16),'Inertie mat.'!A16,\"\")","v":""},{"$f":"IF(ISNUMBER('Inertie mat.'!E16),'Inertie mat.'!B16,\"\")","v":""},{"$f":"IF(ISNUMBER('Inertie mat.'!E16),'Inertie mat.'!C16,\"\")","v":""},{"$f":"IF(ISNUMBER('Inertie mat.'!E16),'Inertie mat.'!D16,\"\")","v":""},{"$f":"IF(ISNUMBER('Inertie mat.'!E16),'Inertie mat.'!E16,\"\")","v":""},{"$f":"IF(ISNUMBER('Inertie mat.'!E16),'Inertie mat.'!F16,\"\")","v":""},{"$f":"IF(ISTEXT('Inertie mat.'!G16),'Inertie mat.'!G16,\"\")","v":""},""]
[{"$f":"IF(ISNUMBER('Inertie mat.'!E17),'Inertie mat.'!A17,\"\")","v":""},{"$f":"IF(ISNUMBER('Inertie mat.'!E17),'Inertie mat.'!B17,\"\")","v":""},{"$f":"IF(ISNUMBER('Inertie mat.'!E17),'Inertie mat.'!C17,\"\")","v":""},{"$f":"IF(ISNUMBER('Inertie mat.'!E17),'Inertie mat.'!D17,\"\")","v":""},{"$f":"IF(ISNUMBER('Inertie mat.'!E17),'Inertie mat.'!E17,\"\")","v":""},{"$f":"IF(ISNUMBER('Inertie mat.'!E17),'Inertie mat.'!F17,\"\")","v":""},{"$f":"IF(ISTEXT('Inertie mat.'!G17),'Inertie mat.'!G17,\"\")","v":""},""]
[{"$f":"IF(ISNUMBER('Inertie mat.'!E18),'Inertie mat.'!A18,\"\")","v":""},{"$f":"IF(ISNUMBER('Inertie mat.'!E18),'Inertie mat.'!B18,\"\")","v":""},{"$f":"IF(ISNUMBER('Inertie mat.'!E18),'Inertie mat.'!C18,\"\")","v":""},{"$f":"IF(ISNUMBER('Inertie mat.'!E18),'Inertie mat.'!D18,\"\")","v":""},{"$f":"IF(ISNUMBER('Inertie mat.'!E18),'Inertie mat.'!E18,\"\")","v":""},{"$f":"IF(ISNUMBER('Inertie mat.'!E18),'Inertie mat.'!F18,\"\")","v":""},{"$f":"IF(ISTEXT('Inertie mat.'!G18),'Inertie mat.'!G18,\"\")","v":""},""]
[{"$f":"IF(ISNUMBER('Inertie mat.'!E19),'Inertie mat.'!A19,\"\")","v":""},{"$f":"IF(ISNUMBER('Inertie mat.'!E19),'Inertie mat.'!B19,\"\")","v":""},{"$f":"IF(ISNUMBER('Inertie mat.'!E19),'Inertie mat.'!C19,\"\")","v":""},{"$f":"IF(ISNUMBER('Inertie mat.'!E19),'Inertie mat.'!D19,\"\")","v":""},{"$f":"IF(ISNUMBER('Inertie mat.'!E19),'Inertie mat.'!E19,\"\")","v":""},{"$f":"IF(ISNUMBER('Inertie mat.'!E19),'Inertie mat.'!F19,\"\")","v":""},{"$f":"IF(ISTEXT('Inertie mat.'!G19),'Inertie mat.'!G19,\"\")","v":""},""]
[{"$f":"IF(ISNUMBER('Inertie mat.'!E20),'Inertie mat.'!A20,\"\")","v":""},{"$f":"IF(ISNUMBER('Inertie mat.'!E20),'Inertie mat.'!B20,\"\")","v":""},{"$f":"IF(ISNUMBER('Inertie mat.'!E20),'Inertie mat.'!C20,\"\")","v":""},{"$f":"IF(ISNUMBER('Inertie mat.'!E20),'Inertie mat.'!D20,\"\")","v":""},{"$f":"IF(ISNUMBER('Inertie mat.'!E20),'Inertie mat.'!E20,\"\")","v":""},{"$f":"IF(ISNUMBER('Inertie mat.'!E20),'Inertie mat.'!F20,\"\")","v":""},{"$f":"IF(ISTEXT('Inertie mat.'!G20),'Inertie mat.'!G20,\"\")","v":""},""]
[{"$f":"IF(ISNUMBER('Inertie mat.'!E21),'Inertie mat.'!A21,\"\")","v":""},{"$f":"IF(ISNUMBER('Inertie mat.'!E21),'Inertie mat.'!B21,\"\")","v":""},{"$f":"IF(ISNUMBER('Inertie mat.'!E21),'Inertie mat.'!C21,\"\")","v":""},{"$f":"IF(ISNUMBER('Inertie mat.'!E21),'Inertie mat.'!D21,\"\")","v":""},{"$f":"IF(ISNUMBER('Inertie mat.'!E21),'Inertie mat.'!E21,\"\")","v":""},{"$f":"IF(ISNUMBER('Inertie mat.'!E21),'Inertie mat.'!F21,\"\")","v":""},{"$f":"IF(ISTEXT('Inertie mat.'!G21),'Inertie mat.'!G21,\"\")","v":""},""]
[{"$f":"IF(ISNUMBER('Inertie mat.'!E22),'Inertie mat.'!A22,\"\")","v":""},{"$f":"IF(ISNUMBER('Inertie mat.'!E22),'Inertie mat.'!B22,\"\")","v":""},{"$f":"IF(ISNUMBER('Inertie mat.'!E22),'Inertie mat.'!C22,\"\")","v":""},{"$f":"IF(ISNUMBER('Inertie mat.'!E22),'Inertie mat.'!D22,\"\")","v":""},{"$f":"IF(ISNUMBER('Inertie mat.'!E22),'Inertie mat.'!E22,\"\")","v":""},{"$f":"IF(ISNUMBER('Inertie mat.'!E22),'Inertie mat.'!F22,\"\")","v":""},{"$f":"IF(ISTEXT('Inertie mat.'!G22),'Inertie mat.'!G22,\"\")","v":""},""]
[{"$f":"IF(ISNUMBER('Inertie mat.'!E23),'Inertie mat.'!A23,\"\")","v":""},{"$f":"IF(ISNUMBER('Inertie mat.'!E23),'Inertie mat.'!B23,\"\")","v":""},{"$f":"IF(ISNUMBER('Inertie mat.'!E23),'Inertie mat.'!C23,\"\")","v":""},{"$f":"IF(ISNUMBER('Inertie mat.'!E23),'Inertie mat.'!D23,\"\")","v":""},{"$f":"IF(ISNUMBER('Inertie mat.'!E23),'Inertie mat.'!E23,\"\")","v":""},{"$f":"IF(ISNUMBER('Inertie mat.'!E23),'Inertie mat.'!F23,\"\")","v":""},{"$f":"IF(ISTEXT('Inertie mat.'!G23),'Inertie mat.'!G23,\"\")","v":""},""]
[{"$f":"IF(ISNUMBER('Inertie mat.'!E24),'Inertie mat.'!A24,\"\")","v":""},{"$f":"IF(ISNUMBER('Inertie mat.'!E24),'Inertie mat.'!B24,\"\")","v":""},{"$f":"IF(ISNUMBER('Inertie mat.'!E24),'Inertie mat.'!C24,\"\")","v":""},{"$f":"IF(ISNUMBER('Inertie mat.'!E24),'Inertie mat.'!D24,\"\")","v":""},{"$f":"IF(ISNUMBER('Inertie mat.'!E24),'Inertie mat.'!E24,\"\")","v":""},{"$f":"IF(ISNUMBER('Inertie mat.'!E24),'Inertie mat.'!F24,\"\")","v":""},{"$f":"IF(ISTEXT('Inertie mat.'!G24),'Inertie mat.'!G24,\"\")","v":""},""]
[{"$f":"IF(ISNUMBER('Inertie mat.'!E25),'Inertie mat.'!A25,\"\")","v":""},{"$f":"IF(ISNUMBER('Inertie mat.'!E25),'Inertie mat.'!B25,\"\")","v":""},{"$f":"IF(ISNUMBER('Inertie mat.'!E25),'Inertie mat.'!C25,\"\")","v":""},{"$f":"IF(ISNUMBER('Inertie mat.'!E25),'Inertie mat.'!D25,\"\")","v":""},{"$f":"IF(ISNUMBER('Inertie mat.'!E25),'Inertie mat.'!E25,\"\")","v":""},{"$f":"IF(ISNUMBER('Inertie mat.'!E25),'Inertie mat.'!F25,\"\")","v":""},{"$f":"IF(ISTEXT('Inertie mat.'!G25),'Inertie mat.'!G25,\"\")","v":""},""]
[{"$f":"IF(ISNUMBER('Inertie mat.'!E26),'Inertie mat.'!A26,\"\")","v":""},{"$f":"IF(ISNUMBER('Inertie mat.'!E26),'Inertie mat.'!B26,\"\")","v":""},{"$f":"IF(ISNUMBER('Inertie mat.'!E26),'Inertie mat.'!C26,\"\")","v":""},{"$f":"IF(ISNUMBER('Inertie mat.'!E26),'Inertie mat.'!D26,\"\")","v":""},{"$f":"IF(ISNUMBER('Inertie mat.'!E26),'Inertie mat.'!E26,\"\")","v":""},{"$f":"IF(ISNUMBER('Inertie mat.'!E26),'Inertie mat.'!F26,\"\")","v":""},{"$f":"IF(ISTEXT('Inertie mat.'!G26),'Inertie mat.'!G26,\"\")","v":""},""]
[{"$f":"IF(ISNUMBER('Inertie mat.'!E27),'Inertie mat.'!A27,\"\")","v":""},{"$f":"IF(ISNUMBER('Inertie mat.'!E27),'Inertie mat.'!B27,\"\")","v":""},{"$f":"IF(ISNUMBER('Inertie mat.'!E27),'Inertie mat.'!C27,\"\")","v":""},{"$f":"IF(ISNUMBER('Inertie mat.'!E27),'Inertie mat.'!D27,\"\")","v":""},{"$f":"IF(ISNUMBER('Inertie mat.'!E27),'Inertie mat.'!E27,\"\")","v":""},{"$f":"IF(ISNUMBER('Inertie mat.'!E27),'Inertie mat.'!F27,\"\")","v":""},{"$f":"IF(ISTEXT('Inertie mat.'!G27),'Inertie mat.'!G27,\"\")","v":""},""]
[{"$f":"IF(ISNUMBER('Inertie mat.'!E28),'Inertie mat.'!A28,\"\")","v":""},{"$f":"IF(ISNUMBER('Inertie mat.'!E28),'Inertie mat.'!B28,\"\")","v":""},{"$f":"IF(ISNUMBER('Inertie mat.'!E28),'Inertie mat.'!C28,\"\")","v":""},{"$f":"IF(ISNUMBER('Inertie mat.'!E28),'Inertie mat.'!D28,\"\")","v":""},{"$f":"IF(ISNUMBER('Inertie mat.'!E28),'Inertie mat.'!E28,\"\")","v":""},{"$f":"IF(ISNUMBER('Inertie mat.'!E28),'Inertie mat.'!F28,\"\")","v":""},{"$f":"IF(ISTEXT('Inertie mat.'!G28),'Inertie mat.'!G28,\"\")","v":""},""]
[{"$f":"IF(ISNUMBER('Inertie mat.'!E29),'Inertie mat.'!A29,\"\")","v":""},{"$f":"IF(ISNUMBER('Inertie mat.'!E29),'Inertie mat.'!B29,\"\")","v":""},{"$f":"IF(ISNUMBER('Inertie mat.'!E29),'Inertie mat.'!C29,\"\")","v":""},{"$f":"IF(ISNUMBER('Inertie mat.'!E29),'Inertie mat.'!D29,\"\")","v":""},{"$f":"IF(ISNUMBER('Inertie mat.'!E29),'Inertie mat.'!E29,\"\")","v":""},{"$f":"IF(ISNUMBER('Inertie mat.'!E29),'Inertie mat.'!F29,\"\")","v":""},{"$f":"IF(ISTEXT('Inertie mat.'!G29),'Inertie mat.'!G29,\"\")","v":""},""]
[{"$f":"IF(ISNUMBER('Inertie mat.'!E30),'Inertie mat.'!A30,\"\")","v":""},{"$f":"IF(ISNUMBER('Inertie mat.'!E30),'Inertie mat.'!B30,\"\")","v":""},{"$f":"IF(ISNUMBER('Inertie mat.'!E30),'Inertie mat.'!C30,\"\")","v":""},{"$f":"IF(ISNUMBER('Inertie mat.'!E30),'Inertie mat.'!D30,\"\")","v":""},{"$f":"IF(ISNUMBER('Inertie mat.'!E30),'Inertie mat.'!E30,\"\")","v":""},{"$f":"IF(ISNUMBER('Inertie mat.'!E30),'Inertie mat.'!F30,\"\")","v":""},{"$f":"IF(ISTEXT('Inertie mat.'!G30),'Inertie mat.'!G30,\"\")","v":""},""]
[{"$f":"IF(ISNUMBER('Inertie mat.'!E31),'Inertie mat.'!A31,\"\")","v":""},{"$f":"IF(ISNUMBER('Inertie mat.'!E31),'Inertie mat.'!B31,\"\")","v":""},{"$f":"IF(ISNUMBER('Inertie mat.'!E31),'Inertie mat.'!C31,\"\")","v":""},{"$f":"IF(ISNUMBER('Inertie mat.'!E31),'Inertie mat.'!D31,\"\")","v":""},{"$f":"IF(ISNUMBER('Inertie mat.'!E31),'Inertie mat.'!E31,\"\")","v":""},{"$f":"IF(ISNUMBER('Inertie mat.'!E31),'Inertie mat.'!F31,\"\")","v":""},{"$f":"IF(ISTEXT('Inertie mat.'!G31),'Inertie mat.'!G31,\"\")","v":""},""]
[{"$f":"IF(ISNUMBER('Inertie mat.'!E32),'Inertie mat.'!A32,\"\")","v":""},{"$f":"IF(ISNUMBER('Inertie mat.'!E32),'Inertie mat.'!B32,\"\")","v":""},{"$f":"IF(ISNUMBER('Inertie mat.'!E32),'Inertie mat.'!C32,\"\")","v":""},{"$f":"IF(ISNUMBER('Inertie mat.'!E32),'Inertie mat.'!D32,\"\")","v":""},{"$f":"IF(ISNUMBER('Inertie mat.'!E32),'Inertie mat.'!E32,\"\")","v":""},{"$f":"IF(ISNUMBER('Inertie mat.'!E32),'Inertie mat.'!F32,\"\")","v":""},{"$f":"IF(ISTEXT('Inertie mat.'!G32),'Inertie mat.'!G32,\"\")","v":""},{"$f":"IF(ISNUMBER(E111),\"yes\",\"\")","v":""}]
[{"$f":"IF(ISNUMBER('Inertie mat.'!E33),'Inertie mat.'!A33,\"\")","v":""},{"$f":"IF(ISNUMBER('Inertie mat.'!E33),'Inertie mat.'!B33,\"\")","v":""},{"$f":"IF(ISNUMBER('Inertie mat.'!E33),'Inertie mat.'!C33,\"\")","v":""},{"$f":"IF(ISNUMBER('Inertie mat.'!E33),'Inertie mat.'!D33,\"\")","v":""},{"$f":"IF(ISNUMBER('Inertie mat.'!E33),'Inertie mat.'!E33,\"\")","v":""},{"$f":"IF(ISNUMBER('Inertie mat.'!E33),'Inertie mat.'!F33,\"\")","v":""},{"$f":"IF(ISTEXT('Inertie mat.'!G33),'Inertie mat.'!G33,\"\")","v":""},""]
[{"$f":"IF(ISNUMBER('Inertie mat.'!E34),'Inertie mat.'!A34,\"\")","v":""},{"$f":"IF(ISNUMBER('Inertie mat.'!E34),'Inertie mat.'!B34,\"\")","v":""},{"$f":"IF(ISNUMBER('Inertie mat.'!E34),'Inertie mat.'!C34,\"\")","v":""},{"$f":"IF(ISNUMBER('Inertie mat.'!E34),'Inertie mat.'!D34,\"\")","v":""},{"$f":"IF(ISNUMBER('Inertie mat.'!E34),'Inertie mat.'!E34,\"\")","v":""},{"$f":"IF(ISNUMBER('Inertie mat.'!E34),'Inertie mat.'!F34,\"\")","v":""},{"$f":"IF(ISTEXT('Inertie mat.'!G34),'Inertie mat.'!G34,\"\")","v":""},""]
[]
[]
[{"$f":"IF(ISNUMBER('Jumta seg.'!G4),'Jumta seg.'!A4,\"\")","v":""},{"$f":"IF(ISNUMBER('Jumta seg.'!G4),'Jumta seg.'!B4,\"\")","v":""},{"$f":"IF(ISNUMBER('Jumta seg.'!G4),'Jumta seg.'!C4,\"\")","v":""},{"$f":"IF(ISNUMBER('Jumta seg.'!G4),'Jumta seg.'!E4,\"\")","v":""},{"$f":"IF(ISNUMBER('Jumta seg.'!G4),'Jumta seg.'!G4,\"\")","v":""},{"$f":"IF(ISNUMBER('Jumta seg.'!G4),'Jumta seg.'!H4,\"\")","v":""},{"$f":"IF(ISTEXT('Jumta seg.'!I4),'Jumta seg.'!I4,\"\")","v":""},""]
[{"$f":"IF(ISNUMBER('Jumta seg.'!G5),'Jumta seg.'!A5,\"\")","v":""},{"$f":"IF(ISNUMBER('Jumta seg.'!G5),'Jumta seg.'!B5,\"\")","v":""},{"$f":"IF(ISNUMBER('Jumta seg.'!G5),'Jumta seg.'!C5,\"\")","v":""},{"$f":"IF(ISNUMBER('Jumta seg.'!G5),'Jumta seg.'!E5,\"\")","v":""},{"$f":"IF(ISNUMBER('Jumta seg.'!G5),'Jumta seg.'!G5,\"\")","v":""},{"$f":"IF(ISNUMBER('Jumta seg.'!G5),'Jumta seg.'!H5,\"\")","v":""},{"$f":"IF(ISTEXT('Jumta seg.'!I5),'Jumta seg.'!I5,\"\")","v":""},""]
[{"$f":"IF(ISNUMBER('Jumta seg.'!G6),'Jumta seg.'!A6,\"\")","v":""},{"$f":"IF(ISNUMBER('Jumta seg.'!G6),'Jumta seg.'!B6,\"\")","v":""},{"$f":"IF(ISNUMBER('Jumta seg.'!G6),'Jumta seg.'!C6,\"\")","v":""},{"$f":"IF(ISNUMBER('Jumta seg.'!G6),'Jumta seg.'!E6,\"\")","v":""},{"$f":"IF(ISNUMBER('Jumta seg.'!G6),'Jumta seg.'!G6,\"\")","v":""},{"$f":"IF(ISNUMBER('Jumta seg.'!G6),'Jumta seg.'!H6,\"\")","v":""},{"$f":"IF(ISTEXT('Jumta seg.'!I6),'Jumta seg.'!I6,\"\")","v":""},""]
[{"$f":"IF(ISNUMBER('Jumta seg.'!G7),'Jumta seg.'!A7,\"\")","v":""},{"$f":"IF(ISNUMBER('Jumta seg.'!G7),'Jumta seg.'!B7,\"\")","v":""},{"$f":"IF(ISNUMBER('Jumta seg.'!G7),'Jumta seg.'!C7,\"\")","v":""},{"$f":"IF(ISNUMBER('Jumta seg.'!G7),'Jumta seg.'!E7,\"\")","v":""},{"$f":"IF(ISNUMBER('Jumta seg.'!G7),'Jumta seg.'!G7,\"\")","v":""},{"$f":"IF(ISNUMBER('Jumta seg.'!G7),'Jumta seg.'!H7,\"\")","v":""},{"$f":"IF(ISTEXT('Jumta seg.'!I7),'Jumta seg.'!I7,\"\")","v":""},""]
[{"$f":"IF(ISNUMBER('Jumta seg.'!G8),'Jumta seg.'!A8,\"\")","v":""},{"$f":"IF(ISNUMBER('Jumta seg.'!G8),'Jumta seg.'!B8,\"\")","v":""},{"$f":"IF(ISNUMBER('Jumta seg.'!G8),'Jumta seg.'!C8,\"\")","v":""},{"$f":"IF(ISNUMBER('Jumta seg.'!G8),'Jumta seg.'!E8,\"\")","v":""},{"$f":"IF(ISNUMBER('Jumta seg.'!G8),'Jumta seg.'!G8,\"\")","v":""},{"$f":"IF(ISNUMBER('Jumta seg.'!G8),'Jumta seg.'!H8,\"\")","v":""},{"$f":"IF(ISTEXT('Jumta seg.'!I8),'Jumta seg.'!I8,\"\")","v":""},""]
[{"$f":"IF(ISNUMBER('Jumta seg.'!G9),'Jumta seg.'!A9,\"\")","v":""},{"$f":"IF(ISNUMBER('Jumta seg.'!G9),'Jumta seg.'!B9,\"\")","v":""},{"$f":"IF(ISNUMBER('Jumta seg.'!G9),'Jumta seg.'!C9,\"\")","v":""},{"$f":"IF(ISNUMBER('Jumta seg.'!G9),'Jumta seg.'!E9,\"\")","v":""},{"$f":"IF(ISNUMBER('Jumta seg.'!G9),'Jumta seg.'!G9,\"\")","v":""},{"$f":"IF(ISNUMBER('Jumta seg.'!G9),'Jumta seg.'!H9,\"\")","v":""},{"$f":"IF(ISTEXT('Jumta seg.'!I9),'Jumta seg.'!I9,\"\")","v":""},""]
[{"$f":"IF(ISNUMBER('Jumta seg.'!G10),'Jumta seg.'!A10,\"\")","v":""},{"$f":"IF(ISNUMBER('Jumta seg.'!G10),'Jumta seg.'!B10,\"\")","v":""},{"$f":"IF(ISNUMBER('Jumta seg.'!G10),'Jumta seg.'!C10,\"\")","v":""},{"$f":"IF(ISNUMBER('Jumta seg.'!G10),'Jumta seg.'!E10,\"\")","v":""},{"$f":"IF(ISNUMBER('Jumta seg.'!G10),'Jumta seg.'!G10,\"\")","v":""},{"$f":"IF(ISNUMBER('Jumta seg.'!G10),'Jumta seg.'!H10,\"\")","v":""},{"$f":"IF(ISTEXT('Jumta seg.'!I10),'Jumta seg.'!I10,\"\")","v":""},""]
[{"$f":"IF(ISNUMBER('Jumta seg.'!G11),'Jumta seg.'!A11,\"\")","v":""},{"$f":"IF(ISNUMBER('Jumta seg.'!G11),'Jumta seg.'!B11,\"\")","v":""},{"$f":"IF(ISNUMBER('Jumta seg.'!G11),'Jumta seg.'!C11,\"\")","v":""},{"$f":"IF(ISNUMBER('Jumta seg.'!G11),'Jumta seg.'!E11,\"\")","v":""},{"$f":"IF(ISNUMBER('Jumta seg.'!G11),'Jumta seg.'!G11,\"\")","v":""},{"$f":"IF(ISNUMBER('Jumta seg.'!G11),'Jumta seg.'!H11,\"\")","v":""},{"$f":"IF(ISTEXT('Jumta seg.'!I11),'Jumta seg.'!I11,\"\")","v":""},""]
[{"$f":"IF(ISNUMBER('Jumta seg.'!G12),'Jumta seg.'!A12,\"\")","v":""},{"$f":"IF(ISNUMBER('Jumta seg.'!G12),'Jumta seg.'!B12,\"\")","v":""},{"$f":"IF(ISNUMBER('Jumta seg.'!G12),'Jumta seg.'!C12,\"\")","v":""},{"$f":"IF(ISNUMBER('Jumta seg.'!G12),'Jumta seg.'!E12,\"\")","v":""},{"$f":"IF(ISNUMBER('Jumta seg.'!G12),'Jumta seg.'!G12,\"\")","v":""},{"$f":"IF(ISNUMBER('Jumta seg.'!G12),'Jumta seg.'!H12,\"\")","v":""},{"$f":"IF(ISTEXT('Jumta seg.'!I12),'Jumta seg.'!I12,\"\")","v":""},""]
[{"$f":"IF(ISNUMBER('Jumta seg.'!G13),'Jumta seg.'!A13,\"\")","v":""},{"$f":"IF(ISNUMBER('Jumta seg.'!G13),'Jumta seg.'!B13,\"\")","v":""},{"$f":"IF(ISNUMBER('Jumta seg.'!G13),'Jumta seg.'!C13,\"\")","v":""},{"$f":"IF(ISNUMBER('Jumta seg.'!G13),'Jumta seg.'!E13,\"\")","v":""},{"$f":"IF(ISNUMBER('Jumta seg.'!G13),'Jumta seg.'!G13,\"\")","v":""},{"$f":"IF(ISNUMBER('Jumta seg.'!G13),'Jumta seg.'!H13,\"\")","v":""},{"$f":"IF(ISTEXT('Jumta seg.'!I13),'Jumta seg.'!I13,\"\")","v":""},""]
[{"$f":"IF(ISNUMBER('Jumta seg.'!G14),'Jumta seg.'!A14,\"\")","v":""},{"$f":"IF(ISNUMBER('Jumta seg.'!G14),'Jumta seg.'!B14,\"\")","v":""},{"$f":"IF(ISNUMBER('Jumta seg.'!G14),'Jumta seg.'!C14,\"\")","v":""},{"$f":"IF(ISNUMBER('Jumta seg.'!G14),'Jumta seg.'!E14,\"\")","v":""},{"$f":"IF(ISNUMBER('Jumta seg.'!G14),'Jumta seg.'!G14,\"\")","v":""},{"$f":"IF(ISNUMBER('Jumta seg.'!G14),'Jumta seg.'!H14,\"\")","v":""},{"$f":"IF(ISTEXT('Jumta seg.'!I14),'Jumta seg.'!I14,\"\")","v":""},""]
[{"$f":"IF(ISNUMBER('Jumta seg.'!G15),'Jumta seg.'!A15,\"\")","v":""},{"$f":"IF(ISNUMBER('Jumta seg.'!G15),'Jumta seg.'!B15,\"\")","v":""},{"$f":"IF(ISNUMBER('Jumta seg.'!G15),'Jumta seg.'!C15,\"\")","v":""},{"$f":"IF(ISNUMBER('Jumta seg.'!G15),'Jumta seg.'!E15,\"\")","v":""},{"$f":"IF(ISNUMBER('Jumta seg.'!G15),'Jumta seg.'!G15,\"\")","v":""},{"$f":"IF(ISNUMBER('Jumta seg.'!G15),'Jumta seg.'!H15,\"\")","v":""},{"$f":"IF(ISTEXT('Jumta seg.'!I15),'Jumta seg.'!I15,\"\")","v":""},""]
[{"$f":"IF(ISNUMBER('Jumta seg.'!G16),'Jumta seg.'!A16,\"\")","v":""},{"$f":"IF(ISNUMBER('Jumta seg.'!G16),'Jumta seg.'!B16,\"\")","v":""},{"$f":"IF(ISNUMBER('Jumta seg.'!G16),'Jumta seg.'!C16,\"\")","v":""},{"$f":"IF(ISNUMBER('Jumta seg.'!G16),'Jumta seg.'!E16,\"\")","v":""},{"$f":"IF(ISNUMBER('Jumta seg.'!G16),'Jumta seg.'!G16,\"\")","v":""},{"$f":"IF(ISNUMBER('Jumta seg.'!G16),'Jumta seg.'!H16,\"\")","v":""},{"$f":"IF(ISTEXT('Jumta seg.'!I16),'Jumta seg.'!I16,\"\")","v":""},""]
[{"$f":"IF(ISNUMBER('Jumta seg.'!G17),'Jumta seg.'!A17,\"\")","v":""},{"$f":"IF(ISNUMBER('Jumta seg.'!G17),'Jumta seg.'!B17,\"\")","v":""},{"$f":"IF(ISNUMBER('Jumta seg.'!G17),'Jumta seg.'!C17,\"\")","v":""},{"$f":"IF(ISNUMBER('Jumta seg.'!G17),'Jumta seg.'!E17,\"\")","v":""},{"$f":"IF(ISNUMBER('Jumta seg.'!G17),'Jumta seg.'!G17,\"\")","v":""},{"$f":"IF(ISNUMBER('Jumta seg.'!G17),'Jumta seg.'!H17,\"\")","v":""},{"$f":"IF(ISTEXT('Jumta seg.'!I17),'Jumta seg.'!I17,\"\")","v":""},""]
[{"$f":"IF(ISNUMBER('Jumta seg.'!G18),'Jumta seg.'!A18,\"\")","v":""},{"$f":"IF(ISNUMBER('Jumta seg.'!G18),'Jumta seg.'!B18,\"\")","v":""},{"$f":"IF(ISNUMBER('Jumta seg.'!G18),'Jumta seg.'!C18,\"\")","v":""},{"$f":"IF(ISNUMBER('Jumta seg.'!G18),'Jumta seg.'!E18,\"\")","v":""},{"$f":"IF(ISNUMBER('Jumta seg.'!G18),'Jumta seg.'!G18,\"\")","v":""},{"$f":"IF(ISNUMBER('Jumta seg.'!G18),'Jumta seg.'!H18,\"\")","v":""},{"$f":"IF(ISTEXT('Jumta seg.'!I18),'Jumta seg.'!I18,\"\")","v":""},""]
[{"$f":"IF(ISNUMBER('Jumta seg.'!G19),'Jumta seg.'!A19,\"\")","v":""},{"$f":"IF(ISNUMBER('Jumta seg.'!G19),'Jumta seg.'!B19,\"\")","v":""},{"$f":"IF(ISNUMBER('Jumta seg.'!G19),'Jumta seg.'!C19,\"\")","v":""},{"$f":"IF(ISNUMBER('Jumta seg.'!G19),'Jumta seg.'!E19,\"\")","v":""},{"$f":"IF(ISNUMBER('Jumta seg.'!G19),'Jumta seg.'!G19,\"\")","v":""},{"$f":"IF(ISNUMBER('Jumta seg.'!G19),'Jumta seg.'!H19,\"\")","v":""},{"$f":"IF(ISTEXT('Jumta seg.'!I19),'Jumta seg.'!I19,\"\")","v":""},""]
[{"$f":"IF(ISNUMBER('Jumta seg.'!G20),'Jumta seg.'!A20,\"\")","v":""},{"$f":"IF(ISNUMBER('Jumta seg.'!G20),'Jumta seg.'!B20,\"\")","v":""},{"$f":"IF(ISNUMBER('Jumta seg.'!G20),'Jumta seg.'!C20,\"\")","v":""},{"$f":"IF(ISNUMBER('Jumta seg.'!G20),'Jumta seg.'!E20,\"\")","v":""},{"$f":"IF(ISNUMBER('Jumta seg.'!G20),'Jumta seg.'!G20,\"\")","v":""},{"$f":"IF(ISNUMBER('Jumta seg.'!G20),'Jumta seg.'!H20,\"\")","v":""},{"$f":"IF(ISTEXT('Jumta seg.'!I20),'Jumta seg.'!I20,\"\")","v":""},""]
[{"$f":"IF(ISNUMBER('Jumta seg.'!G21),'Jumta seg.'!A21,\"\")","v":""},{"$f":"IF(ISNUMBER('Jumta seg.'!G21),'Jumta seg.'!B21,\"\")","v":""},{"$f":"IF(ISNUMBER('Jumta seg.'!G21),'Jumta seg.'!C21,\"\")","v":""},{"$f":"IF(ISNUMBER('Jumta seg.'!G21),'Jumta seg.'!E21,\"\")","v":""},{"$f":"IF(ISNUMBER('Jumta seg.'!G21),'Jumta seg.'!G21,\"\")","v":""},{"$f":"IF(ISNUMBER('Jumta seg.'!G21),'Jumta seg.'!H21,\"\")","v":""},{"$f":"IF(ISTEXT('Jumta seg.'!I21),'Jumta seg.'!I21,\"\")","v":""},""]
[{"$f":"IF(ISNUMBER('Jumta seg.'!G22),'Jumta seg.'!A22,\"\")","v":""},{"$f":"IF(ISNUMBER('Jumta seg.'!G22),'Jumta seg.'!B22,\"\")","v":""},{"$f":"IF(ISNUMBER('Jumta seg.'!G22),'Jumta seg.'!C22,\"\")","v":""},{"$f":"IF(ISNUMBER('Jumta seg.'!G22),'Jumta seg.'!E22,\"\")","v":""},{"$f":"IF(ISNUMBER('Jumta seg.'!G22),'Jumta seg.'!G22,\"\")","v":""},{"$f":"IF(ISNUMBER('Jumta seg.'!G22),'Jumta seg.'!H22,\"\")","v":""},{"$f":"IF(ISTEXT('Jumta seg.'!I22),'Jumta seg.'!I22,\"\")","v":""},""]
[{"$f":"IF(ISNUMBER('Jumta seg.'!G23),'Jumta seg.'!A23,\"\")","v":""},{"$f":"IF(ISNUMBER('Jumta seg.'!G23),'Jumta seg.'!B23,\"\")","v":""},{"$f":"IF(ISNUMBER('Jumta seg.'!G23),'Jumta seg.'!C23,\"\")","v":""},{"$f":"IF(ISNUMBER('Jumta seg.'!G23),'Jumta seg.'!E23,\"\")","v":""},{"$f":"IF(ISNUMBER('Jumta seg.'!G23),'Jumta seg.'!G23,\"\")","v":""},{"$f":"IF(ISNUMBER('Jumta seg.'!G23),'Jumta seg.'!H23,\"\")","v":""},{"$f":"IF(ISTEXT('Jumta seg.'!I23),'Jumta seg.'!I23,\"\")","v":""},""]
[{"$f":"IF(ISNUMBER('Jumta seg.'!G24),'Jumta seg.'!A24,\"\")","v":""},{"$f":"IF(ISNUMBER('Jumta seg.'!G24),'Jumta seg.'!B24,\"\")","v":""},{"$f":"IF(ISNUMBER('Jumta seg.'!G24),'Jumta seg.'!C24,\"\")","v":""},{"$f":"IF(ISNUMBER('Jumta seg.'!G24),'Jumta seg.'!E24,\"\")","v":""},{"$f":"IF(ISNUMBER('Jumta seg.'!G24),'Jumta seg.'!G24,\"\")","v":""},{"$f":"IF(ISNUMBER('Jumta seg.'!G24),'Jumta seg.'!H24,\"\")","v":""},{"$f":"IF(ISTEXT('Jumta seg.'!I24),'Jumta seg.'!I24,\"\")","v":""},""]
[{"$f":"IF(ISNUMBER('Jumta seg.'!G25),'Jumta seg.'!A25,\"\")","v":""},{"$f":"IF(ISNUMBER('Jumta seg.'!G25),'Jumta seg.'!B25,\"\")","v":""},{"$f":"IF(ISNUMBER('Jumta seg.'!G25),'Jumta seg.'!C25,\"\")","v":""},{"$f":"IF(ISNUMBER('Jumta seg.'!G25),'Jumta seg.'!E25,\"\")","v":""},{"$f":"IF(ISNUMBER('Jumta seg.'!G25),'Jumta seg.'!G25,\"\")","v":""},{"$f":"IF(ISNUMBER('Jumta seg.'!G25),'Jumta seg.'!H25,\"\")","v":""},{"$f":"IF(ISTEXT('Jumta seg.'!I25),'Jumta seg.'!I25,\"\")","v":""},""]
[{"$f":"IF(ISNUMBER('Jumta seg.'!G26),'Jumta seg.'!A26,\"\")","v":""},{"$f":"IF(ISNUMBER('Jumta seg.'!G26),'Jumta seg.'!B26,\"\")","v":""},{"$f":"IF(ISNUMBER('Jumta seg.'!G26),'Jumta seg.'!C26,\"\")","v":""},{"$f":"IF(ISNUMBER('Jumta seg.'!G26),'Jumta seg.'!E26,\"\")","v":""},{"$f":"IF(ISNUMBER('Jumta seg.'!G26),'Jumta seg.'!G26,\"\")","v":""},{"$f":"IF(ISNUMBER('Jumta seg.'!G26),'Jumta seg.'!H26,\"\")","v":""},{"$f":"IF(ISTEXT('Jumta seg.'!I26),'Jumta seg.'!I26,\"\")","v":""},""]
[{"$f":"IF(ISNUMBER('Jumta seg.'!G27),'Jumta seg.'!A27,\"\")","v":""},{"$f":"IF(ISNUMBER('Jumta seg.'!G27),'Jumta seg.'!B27,\"\")","v":""},{"$f":"IF(ISNUMBER('Jumta seg.'!G27),'Jumta seg.'!C27,\"\")","v":""},{"$f":"IF(ISNUMBER('Jumta seg.'!G27),'Jumta seg.'!E27,\"\")","v":""},{"$f":"IF(ISNUMBER('Jumta seg.'!G27),'Jumta seg.'!G27,\"\")","v":""},{"$f":"IF(ISNUMBER('Jumta seg.'!G27),'Jumta seg.'!H27,\"\")","v":""},{"$f":"IF(ISTEXT('Jumta seg.'!I27),'Jumta seg.'!I27,\"\")","v":""},""]
[{"$f":"IF(ISNUMBER('Jumta seg.'!G28),'Jumta seg.'!A28,\"\")","v":""},{"$f":"IF(ISNUMBER('Jumta seg.'!G28),'Jumta seg.'!B28,\"\")","v":""},{"$f":"IF(ISNUMBER('Jumta seg.'!G28),'Jumta seg.'!C28,\"\")","v":""},{"$f":"IF(ISNUMBER('Jumta seg.'!G28),'Jumta seg.'!E28,\"\")","v":""},{"$f":"IF(ISNUMBER('Jumta seg.'!G28),'Jumta seg.'!G28,\"\")","v":""},{"$f":"IF(ISNUMBER('Jumta seg.'!G28),'Jumta seg.'!H28,\"\")","v":""},{"$f":"IF(ISTEXT('Jumta seg.'!I28),'Jumta seg.'!I28,\"\")","v":""},""]
[{"$f":"IF(ISNUMBER('Jumta seg.'!G29),'Jumta seg.'!A29,\"\")","v":""},{"$f":"IF(ISNUMBER('Jumta seg.'!G29),'Jumta seg.'!B29,\"\")","v":""},{"$f":"IF(ISNUMBER('Jumta seg.'!G29),'Jumta seg.'!C29,\"\")","v":""},{"$f":"IF(ISNUMBER('Jumta seg.'!G29),'Jumta seg.'!E29,\"\")","v":""},{"$f":"IF(ISNUMBER('Jumta seg.'!G29),'Jumta seg.'!G29,\"\")","v":""},{"$f":"IF(ISNUMBER('Jumta seg.'!G29),'Jumta seg.'!H29,\"\")","v":""},{"$f":"IF(ISTEXT('Jumta seg.'!I29),'Jumta seg.'!I29,\"\")","v":""},""]
[{"$f":"IF(ISNUMBER('Jumta seg.'!G30),'Jumta seg.'!A30,\"\")","v":""},{"$f":"IF(ISNUMBER('Jumta seg.'!G30),'Jumta seg.'!B30,\"\")","v":""},{"$f":"IF(ISNUMBER('Jumta seg.'!G30),'Jumta seg.'!C30,\"\")","v":""},{"$f":"IF(ISNUMBER('Jumta seg.'!G30),'Jumta seg.'!E30,\"\")","v":""},{"$f":"IF(ISNUMBER('Jumta seg.'!G30),'Jumta seg.'!G30,\"\")","v":""},{"$f":"IF(ISNUMBER('Jumta seg.'!G30),'Jumta seg.'!H30,\"\")","v":""},{"$f":"IF(ISTEXT('Jumta seg.'!I30),'Jumta seg.'!I30,\"\")","v":""},""]
[{"$f":"IF(ISNUMBER('Jumta seg.'!G31),'Jumta seg.'!A31,\"\")","v":""},{"$f":"IF(ISNUMBER('Jumta seg.'!G31),'Jumta seg.'!B31,\"\")","v":""},{"$f":"IF(ISNUMBER('Jumta seg.'!G31),'Jumta seg.'!C31,\"\")","v":""},{"$f":"IF(ISNUMBER('Jumta seg.'!G31),'Jumta seg.'!E31,\"\")","v":""},{"$f":"IF(ISNUMBER('Jumta seg.'!G31),'Jumta seg.'!G31,\"\")","v":""},{"$f":"IF(ISNUMBER('Jumta seg.'!G31),'Jumta seg.'!H31,\"\")","v":""},{"$f":"IF(ISTEXT('Jumta seg.'!I31),'Jumta seg.'!I31,\"\")","v":""},""]
[{"$f":"IF(ISNUMBER('Jumta seg.'!G32),'Jumta seg.'!A32,\"\")","v":""},{"$f":"IF(ISNUMBER('Jumta seg.'!G32),'Jumta seg.'!B32,\"\")","v":""},{"$f":"IF(ISNUMBER('Jumta seg.'!G32),'Jumta seg.'!C32,\"\")","v":""},{"$f":"IF(ISNUMBER('Jumta seg.'!G32),'Jumta seg.'!E32,\"\")","v":""},{"$f":"IF(ISNUMBER('Jumta seg.'!G32),'Jumta seg.'!G32,\"\")","v":""},{"$f":"IF(ISNUMBER('Jumta seg.'!G32),'Jumta seg.'!H32,\"\")","v":""},{"$f":"IF(ISTEXT('Jumta seg.'!I32),'Jumta seg.'!I32,\"\")","v":""},""]
[{"$f":"IF(ISNUMBER('Jumta seg.'!G33),'Jumta seg.'!A33,\"\")","v":""},{"$f":"IF(ISNUMBER('Jumta seg.'!G33),'Jumta seg.'!B33,\"\")","v":""},{"$f":"IF(ISNUMBER('Jumta seg.'!G33),'Jumta seg.'!C33,\"\")","v":""},{"$f":"IF(ISNUMBER('Jumta seg.'!G33),'Jumta seg.'!E33,\"\")","v":""},{"$f":"IF(ISNUMBER('Jumta seg.'!G33),'Jumta seg.'!G33,\"\")","v":""},{"$f":"IF(ISNUMBER('Jumta seg.'!G33),'Jumta seg.'!H33,\"\")","v":""},{"$f":"IF(ISTEXT('Jumta seg.'!I33),'Jumta seg.'!I33,\"\")","v":""},""]
[{"$f":"IF(ISNUMBER('Jumta seg.'!G34),'Jumta seg.'!A34,\"\")","v":""},{"$f":"IF(ISNUMBER('Jumta seg.'!G34),'Jumta seg.'!B34,\"\")","v":""},{"$f":"IF(ISNUMBER('Jumta seg.'!G34),'Jumta seg.'!C34,\"\")","v":""},{"$f":"IF(ISNUMBER('Jumta seg.'!G34),'Jumta seg.'!E34,\"\")","v":""},{"$f":"IF(ISNUMBER('Jumta seg.'!G34),'Jumta seg.'!G34,\"\")","v":""},{"$f":"IF(ISNUMBER('Jumta seg.'!G34),'Jumta seg.'!H34,\"\")","v":""},{"$f":"IF(ISTEXT('Jumta seg.'!I34),'Jumta seg.'!I34,\"\")","v":""},""]
[{"$f":"IF(ISNUMBER('Jumta seg.'!G35),'Jumta seg.'!A35,\"\")","v":""},{"$f":"IF(ISNUMBER('Jumta seg.'!G35),'Jumta seg.'!B35,\"\")","v":""},{"$f":"IF(ISNUMBER('Jumta seg.'!G35),'Jumta seg.'!C35,\"\")","v":""},{"$f":"IF(ISNUMBER('Jumta seg.'!G35),'Jumta seg.'!E35,\"\")","v":""},{"$f":"IF(ISNUMBER('Jumta seg.'!G35),'Jumta seg.'!G35,\"\")","v":""},{"$f":"IF(ISNUMBER('Jumta seg.'!G35),'Jumta seg.'!H35,\"\")","v":""},{"$f":"IF(ISTEXT('Jumta seg.'!I35),'Jumta seg.'!I35,\"\")","v":""},""]
[{"$f":"IF(ISNUMBER('Jumta seg.'!G36),'Jumta seg.'!A36,\"\")","v":""},{"$f":"IF(ISNUMBER('Jumta seg.'!G36),'Jumta seg.'!B36,\"\")","v":""},{"$f":"IF(ISNUMBER('Jumta seg.'!G36),'Jumta seg.'!C36,\"\")","v":""},{"$f":"IF(ISNUMBER('Jumta seg.'!G36),'Jumta seg.'!E36,\"\")","v":""},{"$f":"IF(ISNUMBER('Jumta seg.'!G36),'Jumta seg.'!G36,\"\")","v":""},{"$f":"IF(ISNUMBER('Jumta seg.'!G36),'Jumta seg.'!H36,\"\")","v":""},{"$f":"IF(ISTEXT('Jumta seg.'!I36),'Jumta seg.'!I36,\"\")","v":""},""]
[{"$f":"IF(ISNUMBER('Jumta seg.'!G37),'Jumta seg.'!A37,\"\")","v":""},{"$f":"IF(ISNUMBER('Jumta seg.'!G37),'Jumta seg.'!B37,\"\")","v":""},{"$f":"IF(ISNUMBER('Jumta seg.'!G37),'Jumta seg.'!C37,\"\")","v":""},{"$f":"IF(ISNUMBER('Jumta seg.'!G37),'Jumta seg.'!E37,\"\")","v":""},{"$f":"IF(ISNUMBER('Jumta seg.'!G37),'Jumta seg.'!G37,\"\")","v":""},{"$f":"IF(ISNUMBER('Jumta seg.'!G37),'Jumta seg.'!H37,\"\")","v":""},{"$f":"IF(ISTEXT('Jumta seg.'!I37),'Jumta seg.'!I37,\"\")","v":""},""]
[{"$f":"IF(ISNUMBER('Jumta seg.'!G38),'Jumta seg.'!A38,\"\")","v":""},{"$f":"IF(ISNUMBER('Jumta seg.'!G38),'Jumta seg.'!B38,\"\")","v":""},{"$f":"IF(ISNUMBER('Jumta seg.'!G38),'Jumta seg.'!C38,\"\")","v":""},{"$f":"IF(ISNUMBER('Jumta seg.'!G38),'Jumta seg.'!E38,\"\")","v":""},{"$f":"IF(ISNUMBER('Jumta seg.'!G38),'Jumta seg.'!G38,\"\")","v":""},{"$f":"IF(ISNUMBER('Jumta seg.'!G38),'Jumta seg.'!H38,\"\")","v":""},{"$f":"IF(ISTEXT('Jumta seg.'!I38),'Jumta seg.'!I38,\"\")","v":""},""]
[{"$f":"IF(ISNUMBER('Jumta seg.'!G39),'Jumta seg.'!A39,\"\")","v":""},{"$f":"IF(ISNUMBER('Jumta seg.'!G39),'Jumta seg.'!B39,\"\")","v":""},{"$f":"IF(ISNUMBER('Jumta seg.'!G39),'Jumta seg.'!C39,\"\")","v":""},{"$f":"IF(ISNUMBER('Jumta seg.'!G39),'Jumta seg.'!E39,\"\")","v":""},{"$f":"IF(ISNUMBER('Jumta seg.'!G39),'Jumta seg.'!G39,\"\")","v":""},{"$f":"IF(ISNUMBER('Jumta seg.'!G39),'Jumta seg.'!H39,\"\")","v":""},{"$f":"IF(ISTEXT('Jumta seg.'!I39),'Jumta seg.'!I39,\"\")","v":""},""]
[{"$f":"IF(ISNUMBER('Jumta seg.'!G40),'Jumta seg.'!A40,\"\")","v":""},{"$f":"IF(ISNUMBER('Jumta seg.'!G40),'Jumta seg.'!B40,\"\")","v":""},{"$f":"IF(ISNUMBER('Jumta seg.'!G40),'Jumta seg.'!C40,\"\")","v":""},{"$f":"IF(ISNUMBER('Jumta seg.'!G40),'Jumta seg.'!E40,\"\")","v":""},{"$f":"IF(ISNUMBER('Jumta seg.'!G40),'Jumta seg.'!G40,\"\")","v":""},{"$f":"IF(ISNUMBER('Jumta seg.'!G40),'Jumta seg.'!H40,\"\")","v":""},{"$f":"IF(ISTEXT('Jumta seg.'!I40),'Jumta seg.'!I40,\"\")","v":""},""]
[{"$f":"IF(ISNUMBER('Jumta seg.'!G41),'Jumta seg.'!A41,\"\")","v":""},{"$f":"IF(ISNUMBER('Jumta seg.'!G41),'Jumta seg.'!B41,\"\")","v":""},{"$f":"IF(ISNUMBER('Jumta seg.'!G41),'Jumta seg.'!C41,\"\")","v":""},{"$f":"IF(ISNUMBER('Jumta seg.'!G41),'Jumta seg.'!E41,\"\")","v":""},{"$f":"IF(ISNUMBER('Jumta seg.'!G41),'Jumta seg.'!G41,\"\")","v":""},{"$f":"IF(ISNUMBER('Jumta seg.'!G41),'Jumta seg.'!H41,\"\")","v":""},{"$f":"IF(ISTEXT('Jumta seg.'!I41),'Jumta seg.'!I41,\"\")","v":""},""]
[{"$f":"IF(ISNUMBER('Jumta seg.'!G42),'Jumta seg.'!A42,\"\")","v":""},{"$f":"IF(ISNUMBER('Jumta seg.'!G42),'Jumta seg.'!B42,\"\")","v":""},{"$f":"IF(ISNUMBER('Jumta seg.'!G42),'Jumta seg.'!C42,\"\")","v":""},{"$f":"IF(ISNUMBER('Jumta seg.'!G42),'Jumta seg.'!E42,\"\")","v":""},{"$f":"IF(ISNUMBER('Jumta seg.'!G42),'Jumta seg.'!G42,\"\")","v":""},{"$f":"IF(ISNUMBER('Jumta seg.'!G42),'Jumta seg.'!H42,\"\")","v":""},{"$f":"IF(ISTEXT('Jumta seg.'!I42),'Jumta seg.'!I42,\"\")","v":""},""]
[{"$f":"IF(ISNUMBER('Jumta seg.'!G43),'Jumta seg.'!A43,\"\")","v":""},{"$f":"IF(ISNUMBER('Jumta seg.'!G43),'Jumta seg.'!B43,\"\")","v":""},{"$f":"IF(ISNUMBER('Jumta seg.'!G43),'Jumta seg.'!C43,\"\")","v":""},{"$f":"IF(ISNUMBER('Jumta seg.'!G43),'Jumta seg.'!E43,\"\")","v":""},{"$f":"IF(ISNUMBER('Jumta seg.'!G43),'Jumta seg.'!G43,\"\")","v":""},{"$f":"IF(ISNUMBER('Jumta seg.'!G43),'Jumta seg.'!H43,\"\")","v":""},{"$f":"IF(ISTEXT('Jumta seg.'!I43),'Jumta seg.'!I43,\"\")","v":""},""]
[{"$f":"IF(ISNUMBER('Jumta seg.'!G44),'Jumta seg.'!A44,\"\")","v":""},{"$f":"IF(ISNUMBER('Jumta seg.'!G44),'Jumta seg.'!B44,\"\")","v":""},{"$f":"IF(ISNUMBER('Jumta seg.'!G44),'Jumta seg.'!C44,\"\")","v":""},{"$f":"IF(ISNUMBER('Jumta seg.'!G44),'Jumta seg.'!E44,\"\")","v":""},{"$f":"IF(ISNUMBER('Jumta seg.'!G44),'Jumta seg.'!G44,\"\")","v":""},{"$f":"IF(ISNUMBER('Jumta seg.'!G44),'Jumta seg.'!H44,\"\")","v":""},{"$f":"IF(ISTEXT('Jumta seg.'!I44),'Jumta seg.'!I44,\"\")","v":""},""]
[{"$f":"IF(ISNUMBER('Jumta seg.'!G45),'Jumta seg.'!A45,\"\")","v":""},{"$f":"IF(ISNUMBER('Jumta seg.'!G45),'Jumta seg.'!B45,\"\")","v":""},{"$f":"IF(ISNUMBER('Jumta seg.'!G45),'Jumta seg.'!C45,\"\")","v":""},{"$f":"IF(ISNUMBER('Jumta seg.'!G45),'Jumta seg.'!E45,\"\")","v":""},{"$f":"IF(ISNUMBER('Jumta seg.'!G45),'Jumta seg.'!G45,\"\")","v":""},{"$f":"IF(ISNUMBER('Jumta seg.'!G45),'Jumta seg.'!H45,\"\")","v":""},{"$f":"IF(ISTEXT('Jumta seg.'!I45),'Jumta seg.'!I45,\"\")","v":""},""]
[{"$f":"IF(ISNUMBER('Jumta seg.'!G46),'Jumta seg.'!A46,\"\")","v":""},{"$f":"IF(ISNUMBER('Jumta seg.'!G46),'Jumta seg.'!B46,\"\")","v":""},{"$f":"IF(ISNUMBER('Jumta seg.'!G46),'Jumta seg.'!C46,\"\")","v":""},{"$f":"IF(ISNUMBER('Jumta seg.'!G46),'Jumta seg.'!E46,\"\")","v":""},{"$f":"IF(ISNUMBER('Jumta seg.'!G46),'Jumta seg.'!G46,\"\")","v":""},{"$f":"IF(ISNUMBER('Jumta seg.'!G46),'Jumta seg.'!H46,\"\")","v":""},{"$f":"IF(ISTEXT('Jumta seg.'!I46),'Jumta seg.'!I46,\"\")","v":""},""]
[{"$f":"IF(ISNUMBER('Jumta seg.'!G47),'Jumta seg.'!A47,\"\")","v":""},{"$f":"IF(ISNUMBER('Jumta seg.'!G47),'Jumta seg.'!B47,\"\")","v":""},{"$f":"IF(ISNUMBER('Jumta seg.'!G47),'Jumta seg.'!C47,\"\")","v":""},{"$f":"IF(ISNUMBER('Jumta seg.'!G47),'Jumta seg.'!E47,\"\")","v":""},{"$f":"IF(ISNUMBER('Jumta seg.'!G47),'Jumta seg.'!G47,\"\")","v":""},{"$f":"IF(ISNUMBER('Jumta seg.'!G47),'Jumta seg.'!H47,\"\")","v":""},{"$f":"IF(ISTEXT('Jumta seg.'!I47),'Jumta seg.'!I47,\"\")","v":""},""]
[{"$f":"IF(ISNUMBER('Jumta seg.'!G48),'Jumta seg.'!A48,\"\")","v":""},{"$f":"IF(ISNUMBER('Jumta seg.'!G48),'Jumta seg.'!B48,\"\")","v":""},{"$f":"IF(ISNUMBER('Jumta seg.'!G48),'Jumta seg.'!C48,\"\")","v":""},{"$f":"IF(ISNUMBER('Jumta seg.'!G48),'Jumta seg.'!E48,\"\")","v":""},{"$f":"IF(ISNUMBER('Jumta seg.'!G48),'Jumta seg.'!G48,\"\")","v":""},{"$f":"IF(ISNUMBER('Jumta seg.'!G48),'Jumta seg.'!H48,\"\")","v":""},{"$f":"IF(ISTEXT('Jumta seg.'!I48),'Jumta seg.'!I48,\"\")","v":""},""]
[{"$f":"IF(ISNUMBER('Jumta seg.'!G49),'Jumta seg.'!A49,\"\")","v":""},{"$f":"IF(ISNUMBER('Jumta seg.'!G49),'Jumta seg.'!B49,\"\")","v":""},{"$f":"IF(ISNUMBER('Jumta seg.'!G49),'Jumta seg.'!C49,\"\")","v":""},{"$f":"IF(ISNUMBER('Jumta seg.'!G49),'Jumta seg.'!E49,\"\")","v":""},{"$f":"IF(ISNUMBER('Jumta seg.'!G49),'Jumta seg.'!G49,\"\")","v":""},{"$f":"IF(ISNUMBER('Jumta seg.'!G49),'Jumta seg.'!H49,\"\")","v":""},{"$f":"IF(ISTEXT('Jumta seg.'!I49),'Jumta seg.'!I49,\"\")","v":""},""]
[{"$f":"IF(ISNUMBER('Jumta seg.'!G50),'Jumta seg.'!A50,\"\")","v":""},{"$f":"IF(ISNUMBER('Jumta seg.'!G50),'Jumta seg.'!B50,\"\")","v":""},{"$f":"IF(ISNUMBER('Jumta seg.'!G50),'Jumta seg.'!C50,\"\")","v":""},{"$f":"IF(ISNUMBER('Jumta seg.'!G50),'Jumta seg.'!E50,\"\")","v":""},{"$f":"IF(ISNUMBER('Jumta seg.'!G50),'Jumta seg.'!G50,\"\")","v":""},{"$f":"IF(ISNUMBER('Jumta seg.'!G50),'Jumta seg.'!H50,\"\")","v":""},{"$f":"IF(ISTEXT('Jumta seg.'!I50),'Jumta seg.'!I50,\"\")","v":""},""]
[{"$f":"IF(ISNUMBER('Jumta seg.'!G51),'Jumta seg.'!A51,\"\")","v":""},{"$f":"IF(ISNUMBER('Jumta seg.'!G51),'Jumta seg.'!B51,\"\")","v":""},{"$f":"IF(ISNUMBER('Jumta seg.'!G51),'Jumta seg.'!C51,\"\")","v":""},{"$f":"IF(ISNUMBER('Jumta seg.'!G51),'Jumta seg.'!E51,\"\")","v":""},{"$f":"IF(ISNUMBER('Jumta seg.'!G51),'Jumta seg.'!G51,\"\")","v":""},{"$f":"IF(ISNUMBER('Jumta seg.'!G51),'Jumta seg.'!H51,\"\")","v":""},{"$f":"IF(ISTEXT('Jumta seg.'!I51),'Jumta seg.'!I51,\"\")","v":""},""]
[{"$f":"IF(ISNUMBER('Jumta seg.'!G52),'Jumta seg.'!A52,\"\")","v":""},{"$f":"IF(ISNUMBER('Jumta seg.'!G52),'Jumta seg.'!B52,\"\")","v":""},{"$f":"IF(ISNUMBER('Jumta seg.'!G52),'Jumta seg.'!C52,\"\")","v":""},{"$f":"IF(ISNUMBER('Jumta seg.'!G52),'Jumta seg.'!E52,\"\")","v":""},{"$f":"IF(ISNUMBER('Jumta seg.'!G52),'Jumta seg.'!G52,\"\")","v":""},{"$f":"IF(ISNUMBER('Jumta seg.'!G52),'Jumta seg.'!H52,\"\")","v":""},{"$f":"IF(ISTEXT('Jumta seg.'!I52),'Jumta seg.'!I52,\"\")","v":""},""]
[{"$f":"IF(ISNUMBER('Jumta seg.'!G53),'Jumta seg.'!A53,\"\")","v":""},{"$f":"IF(ISNUMBER('Jumta seg.'!G53),'Jumta seg.'!B53,\"\")","v":""},{"$f":"IF(ISNUMBER('Jumta seg.'!G53),'Jumta seg.'!C53,\"\")","v":""},{"$f":"IF(ISNUMBER('Jumta seg.'!G53),'Jumta seg.'!E53,\"\")","v":""},{"$f":"IF(ISNUMBER('Jumta seg.'!G53),'Jumta seg.'!G53,\"\")","v":""},{"$f":"IF(ISNUMBER('Jumta seg.'!G53),'Jumta seg.'!H53,\"\")","v":""},{"$f":"IF(ISTEXT('Jumta seg.'!I53),'Jumta seg.'!I53,\"\")","v":""},""]
[{"$f":"IF(ISNUMBER('Jumta seg.'!G54),'Jumta seg.'!A54,\"\")","v":""},{"$f":"IF(ISNUMBER('Jumta seg.'!G54),'Jumta seg.'!B54,\"\")","v":""},{"$f":"IF(ISNUMBER('Jumta seg.'!G54),'Jumta seg.'!C54,\"\")","v":""},{"$f":"IF(ISNUMBER('Jumta seg.'!G54),'Jumta seg.'!E54,\"\")","v":""},{"$f":"IF(ISNUMBER('Jumta seg.'!G54),'Jumta seg.'!G54,\"\")","v":""},{"$f":"IF(ISNUMBER('Jumta seg.'!G54),'Jumta seg.'!H54,\"\")","v":""},{"$f":"IF(ISTEXT('Jumta seg.'!I54),'Jumta seg.'!I54,\"\")","v":""},""]
[{"$f":"IF(ISNUMBER('Jumta seg.'!G55),'Jumta seg.'!A55,\"\")","v":""},{"$f":"IF(ISNUMBER('Jumta seg.'!G55),'Jumta seg.'!B55,\"\")","v":""},{"$f":"IF(ISNUMBER('Jumta seg.'!G55),'Jumta seg.'!C55,\"\")","v":""},{"$f":"IF(ISNUMBER('Jumta seg.'!G55),'Jumta seg.'!E55,\"\")","v":""},{"$f":"IF(ISNUMBER('Jumta seg.'!G55),'Jumta seg.'!G55,\"\")","v":""},{"$f":"IF(ISNUMBER('Jumta seg.'!G55),'Jumta seg.'!H55,\"\")","v":""},{"$f":"IF(ISTEXT('Jumta seg.'!I55),'Jumta seg.'!I55,\"\")","v":""},""]
[{"$f":"IF(ISNUMBER('Jumta seg.'!G56),'Jumta seg.'!A56,\"\")","v":""},{"$f":"IF(ISNUMBER('Jumta seg.'!G56),'Jumta seg.'!B56,\"\")","v":""},{"$f":"IF(ISNUMBER('Jumta seg.'!G56),'Jumta seg.'!C56,\"\")","v":""},{"$f":"IF(ISNUMBER('Jumta seg.'!G56),'Jumta seg.'!E56,\"\")","v":""},{"$f":"IF(ISNUMBER('Jumta seg.'!G56),'Jumta seg.'!G56,\"\")","v":""},{"$f":"IF(ISNUMBER('Jumta seg.'!G56),'Jumta seg.'!H56,\"\")","v":""},{"$f":"IF(ISTEXT('Jumta seg.'!I56),'Jumta seg.'!I56,\"\")","v":""},""]
[{"$f":"IF(ISNUMBER('Jumta seg.'!G57),'Jumta seg.'!A57,\"\")","v":""},{"$f":"IF(ISNUMBER('Jumta seg.'!G57),'Jumta seg.'!B57,\"\")","v":""},{"$f":"IF(ISNUMBER('Jumta seg.'!G57),'Jumta seg.'!C57,\"\")","v":""},{"$f":"IF(ISNUMBER('Jumta seg.'!G57),'Jumta seg.'!E57,\"\")","v":""},{"$f":"IF(ISNUMBER('Jumta seg.'!G57),'Jumta seg.'!G57,\"\")","v":""},{"$f":"IF(ISNUMBER('Jumta seg.'!G57),'Jumta seg.'!H57,\"\")","v":""},{"$f":"IF(ISTEXT('Jumta seg.'!I57),'Jumta seg.'!I57,\"\")","v":""},""]
[]
[]
[{"$f":"IF(ISNUMBER(Zāģmateriāli!E4),Zāģmateriāli!A4,\"\")","v":""},{"$f":"IF(ISNUMBER(Zāģmateriāli!E4),Zāģmateriāli!B4,\"\")","v":""},{"$f":"IF(ISNUMBER(Zāģmateriāli!E4),Zāģmateriāli!C4,\"\")","v":""},{"$f":"IF(ISNUMBER(Zāģmateriāli!E4),Zāģmateriāli!D4,\"\")","v":""},{"$f":"IF(ISNUMBER(Zāģmateriāli!E4),Zāģmateriāli!E4,\"\")","v":""},{"$f":"IF(ISNUMBER(Zāģmateriāli!E4),Zāģmateriāli!F4,\"\")","v":""},{"$f":"IF(ISTEXT(Zāģmateriāli!G4),Zāģmateriāli!G4,\"\")","v":""},{"$f":"IF(ISNUMBER(E172),\"yes\",\"\")","v":""}]
[{"$f":"IF(ISNUMBER(Zāģmateriāli!E5),Zāģmateriāli!A5,\"\")","v":""},{"$f":"IF(ISNUMBER(Zāģmateriāli!E5),Zāģmateriāli!B5,\"\")","v":""},{"$f":"IF(ISNUMBER(Zāģmateriāli!E5),Zāģmateriāli!C5,\"\")","v":""},{"$f":"IF(ISNUMBER(Zāģmateriāli!E5),Zāģmateriāli!D5,\"\")","v":""},{"$f":"IF(ISNUMBER(Zāģmateriāli!E5),Zāģmateriāli!E5,\"\")","v":""},{"$f":"IF(ISNUMBER(Zāģmateriāli!E5),Zāģmateriāli!F5,\"\")","v":""},{"$f":"IF(ISTEXT(Zāģmateriāli!G5),Zāģmateriāli!G5,\"\")","v":""},""]
[{"$f":"IF(ISNUMBER(Zāģmateriāli!E6),Zāģmateriāli!A6,\"\")","v":""},{"$f":"IF(ISNUMBER(Zāģmateriāli!E6),Zāģmateriāli!B6,\"\")","v":""},{"$f":"IF(ISNUMBER(Zāģmateriāli!E6),Zāģmateriāli!C6,\"\")","v":""},{"$f":"IF(ISNUMBER(Zāģmateriāli!E6),Zāģmateriāli!D6,\"\")","v":""},{"$f":"IF(ISNUMBER(Zāģmateriāli!E6),Zāģmateriāli!E6,\"\")","v":""},{"$f":"IF(ISNUMBER(Zāģmateriāli!E6),Zāģmateriāli!F6,\"\")","v":""},{"$f":"IF(ISTEXT(Zāģmateriāli!G6),Zāģmateriāli!G6,\"\")","v":""},""]
[{"$f":"IF(ISNUMBER(Zāģmateriāli!E7),Zāģmateriāli!A7,\"\")","v":""},{"$f":"IF(ISNUMBER(Zāģmateriāli!E7),Zāģmateriāli!B7,\"\")","v":""},{"$f":"IF(ISNUMBER(Zāģmateriāli!E7),Zāģmateriāli!C7,\"\")","v":""},{"$f":"IF(ISNUMBER(Zāģmateriāli!E7),Zāģmateriāli!D7,\"\")","v":""},{"$f":"IF(ISNUMBER(Zāģmateriāli!E7),Zāģmateriāli!E7,\"\")","v":""},{"$f":"IF(ISNUMBER(Zāģmateriāli!E7),Zāģmateriāli!F7,\"\")","v":""},{"$f":"IF(ISTEXT(Zāģmateriāli!G7),Zāģmateriāli!G7,\"\")","v":""},""]
[{"$f":"IF(ISNUMBER(Zāģmateriāli!E8),Zāģmateriāli!A8,\"\")","v":""},{"$f":"IF(ISNUMBER(Zāģmateriāli!E8),Zāģmateriāli!B8,\"\")","v":""},{"$f":"IF(ISNUMBER(Zāģmateriāli!E8),Zāģmateriāli!C8,\"\")","v":""},{"$f":"IF(ISNUMBER(Zāģmateriāli!E8),Zāģmateriāli!D8,\"\")","v":""},{"$f":"IF(ISNUMBER(Zāģmateriāli!E8),Zāģmateriāli!E8,\"\")","v":""},{"$f":"IF(ISNUMBER(Zāģmateriāli!E8),Zāģmateriāli!F8,\"\")","v":""},{"$f":"IF(ISTEXT(Zāģmateriāli!G8),Zāģmateriāli!G8,\"\")","v":""},""]
[{"$f":"IF(ISNUMBER(Zāģmateriāli!E9),Zāģmateriāli!A9,\"\")","v":""},{"$f":"IF(ISNUMBER(Zāģmateriāli!E9),Zāģmateriāli!B9,\"\")","v":""},{"$f":"IF(ISNUMBER(Zāģmateriāli!E9),Zāģmateriāli!C9,\"\")","v":""},{"$f":"IF(ISNUMBER(Zāģmateriāli!E9),Zāģmateriāli!D9,\"\")","v":""},{"$f":"IF(ISNUMBER(Zāģmateriāli!E9),Zāģmateriāli!E9,\"\")","v":""},{"$f":"IF(ISNUMBER(Zāģmateriāli!E9),Zāģmateriāli!F9,\"\")","v":""},{"$f":"IF(ISTEXT(Zāģmateriāli!G9),Zāģmateriāli!G9,\"\")","v":""},""]
[{"$f":"IF(ISNUMBER(Zāģmateriāli!E10),Zāģmateriāli!A10,\"\")","v":""},{"$f":"IF(ISNUMBER(Zāģmateriāli!E10),Zāģmateriāli!B10,\"\")","v":""},{"$f":"IF(ISNUMBER(Zāģmateriāli!E10),Zāģmateriāli!C10,\"\")","v":""},{"$f":"IF(ISNUMBER(Zāģmateriāli!E10),Zāģmateriāli!D10,\"\")","v":""},{"$f":"IF(ISNUMBER(Zāģmateriāli!E10),Zāģmateriāli!E10,\"\")","v":""},{"$f":"IF(ISNUMBER(Zāģmateriāli!E10),Zāģmateriāli!F10,\"\")","v":""},{"$f":"IF(ISTEXT(Zāģmateriāli!G10),Zāģmateriāli!G10,\"\")","v":""},""]
[{"$f":"IF(ISNUMBER(Zāģmateriāli!E11),Zāģmateriāli!A11,\"\")","v":""},{"$f":"IF(ISNUMBER(Zāģmateriāli!E11),Zāģmateriāli!B11,\"\")","v":""},{"$f":"IF(ISNUMBER(Zāģmateriāli!E11),Zāģmateriāli!C11,\"\")","v":""},{"$f":"IF(ISNUMBER(Zāģmateriāli!E11),Zāģmateriāli!D11,\"\")","v":""},{"$f":"IF(ISNUMBER(Zāģmateriāli!E11),Zāģmateriāli!E11,\"\")","v":""},{"$f":"IF(ISNUMBER(Zāģmateriāli!E11),Zāģmateriāli!F11,\"\")","v":""},{"$f":"IF(ISTEXT(Zāģmateriāli!G11),Zāģmateriāli!G11,\"\")","v":""},""]
[{"$f":"IF(ISNUMBER(Zāģmateriāli!E12),Zāģmateriāli!A12,\"\")","v":""},{"$f":"IF(ISNUMBER(Zāģmateriāli!E12),Zāģmateriāli!B12,\"\")","v":""},{"$f":"IF(ISNUMBER(Zāģmateriāli!E12),Zāģmateriāli!C12,\"\")","v":""},{"$f":"IF(ISNUMBER(Zāģmateriāli!E12),Zāģmateriāli!D12,\"\")","v":""},{"$f":"IF(ISNUMBER(Zāģmateriāli!E12),Zāģmateriāli!E12,\"\")","v":""},{"$f":"IF(ISNUMBER(Zāģmateriāli!E12),Zāģmateriāli!F12,\"\")","v":""},{"$f":"IF(ISTEXT(Zāģmateriāli!G12),Zāģmateriāli!G12,\"\")","v":""},""]
[{"$f":"IF(ISNUMBER(Zāģmateriāli!E13),Zāģmateriāli!A13,\"\")","v":""},{"$f":"IF(ISNUMBER(Zāģmateriāli!E13),Zāģmateriāli!B13,\"\")","v":""},{"$f":"IF(ISNUMBER(Zāģmateriāli!E13),Zāģmateriāli!C13,\"\")","v":""},{"$f":"IF(ISNUMBER(Zāģmateriāli!E13),Zāģmateriāli!D13,\"\")","v":""},{"$f":"IF(ISNUMBER(Zāģmateriāli!E13),Zāģmateriāli!E13,\"\")","v":""},{"$f":"IF(ISNUMBER(Zāģmateriāli!E13),Zāģmateriāli!F13,\"\")","v":""},{"$f":"IF(ISTEXT(Zāģmateriāli!G13),Zāģmateriāli!G13,\"\")","v":""},""]
[{"$f":"IF(ISNUMBER(Zāģmateriāli!E14),Zāģmateriāli!A14,\"\")","v":""},{"$f":"IF(ISNUMBER(Zāģmateriāli!E14),Zāģmateriāli!B14,\"\")","v":""},{"$f":"IF(ISNUMBER(Zāģmateriāli!E14),Zāģmateriāli!C14,\"\")","v":""},{"$f":"IF(ISNUMBER(Zāģmateriāli!E14),Zāģmateriāli!D14,\"\")","v":""},{"$f":"IF(ISNUMBER(Zāģmateriāli!E14),Zāģmateriāli!E14,\"\")","v":""},{"$f":"IF(ISNUMBER(Zāģmateriāli!E14),Zāģmateriāli!F14,\"\")","v":""},{"$f":"IF(ISTEXT(Zāģmateriāli!G14),Zāģmateriāli!G14,\"\")","v":""},""]
[{"$f":"IF(ISNUMBER(Zāģmateriāli!E15),Zāģmateriāli!A15,\"\")","v":""},{"$f":"IF(ISNUMBER(Zāģmateriāli!E15),Zāģmateriāli!B15,\"\")","v":""},{"$f":"IF(ISNUMBER(Zāģmateriāli!E15),Zāģmateriāli!C15,\"\")","v":""},{"$f":"IF(ISNUMBER(Zāģmateriāli!E15),Zāģmateriāli!D15,\"\")","v":""},{"$f":"IF(ISNUMBER(Zāģmateriāli!E15),Zāģmateriāli!E15,\"\")","v":""},{"$f":"IF(ISNUMBER(Zāģmateriāli!E15),Zāģmateriāli!F15,\"\")","v":""},{"$f":"IF(ISTEXT(Zāģmateriāli!G15),Zāģmateriāli!G15,\"\")","v":""},""]
[{"$f":"IF(ISNUMBER(Zāģmateriāli!E16),Zāģmateriāli!A16,\"\")","v":""},{"$f":"IF(ISNUMBER(Zāģmateriāli!E16),Zāģmateriāli!B16,\"\")","v":""},{"$f":"IF(ISNUMBER(Zāģmateriāli!E16),Zāģmateriāli!C16,\"\")","v":""},{"$f":"IF(ISNUMBER(Zāģmateriāli!E16),Zāģmateriāli!D16,\"\")","v":""},{"$f":"IF(ISNUMBER(Zāģmateriāli!E16),Zāģmateriāli!E16,\"\")","v":""},{"$f":"IF(ISNUMBER(Zāģmateriāli!E16),Zāģmateriāli!F16,\"\")","v":""},{"$f":"IF(ISTEXT(Zāģmateriāli!G16),Zāģmateriāli!G16,\"\")","v":""},""]
[{"$f":"IF(ISNUMBER(Zāģmateriāli!E17),Zāģmateriāli!A17,\"\")","v":""},{"$f":"IF(ISNUMBER(Zāģmateriāli!E17),Zāģmateriāli!B17,\"\")","v":""},{"$f":"IF(ISNUMBER(Zāģmateriāli!E17),Zāģmateriāli!C17,\"\")","v":""},{"$f":"IF(ISNUMBER(Zāģmateriāli!E17),Zāģmateriāli!D17,\"\")","v":""},{"$f":"IF(ISNUMBER(Zāģmateriāli!E17),Zāģmateriāli!E17,\"\")","v":""},{"$f":"IF(ISNUMBER(Zāģmateriāli!E17),Zāģmateriāli!F17,\"\")","v":""},{"$f":"IF(ISTEXT(Zāģmateriāli!G17),Zāģmateriāli!G17,\"\")","v":""},""]
[{"$f":"IF(ISNUMBER(Zāģmateriāli!E18),Zāģmateriāli!A18,\"\")","v":""},{"$f":"IF(ISNUMBER(Zāģmateriāli!E18),Zāģmateriāli!B18,\"\")","v":""},{"$f":"IF(ISNUMBER(Zāģmateriāli!E18),Zāģmateriāli!C18,\"\")","v":""},{"$f":"IF(ISNUMBER(Zāģmateriāli!E18),Zāģmateriāli!D18,\"\")","v":""},{"$f":"IF(ISNUMBER(Zāģmateriāli!E18),Zāģmateriāli!E18,\"\")","v":""},{"$f":"IF(ISNUMBER(Zāģmateriāli!E18),Zāģmateriāli!F18,\"\")","v":""},{"$f":"IF(ISTEXT(Zāģmateriāli!G18),Zāģmateriāli!G18,\"\")","v":""},""]
[{"$f":"IF(ISNUMBER(Zāģmateriāli!E19),Zāģmateriāli!A19,\"\")","v":""},{"$f":"IF(ISNUMBER(Zāģmateriāli!E19),Zāģmateriāli!B19,\"\")","v":""},{"$f":"IF(ISNUMBER(Zāģmateriāli!E19),Zāģmateriāli!C19,\"\")","v":""},{"$f":"IF(ISNUMBER(Zāģmateriāli!E19),Zāģmateriāli!D19,\"\")","v":""},{"$f":"IF(ISNUMBER(Zāģmateriāli!E19),Zāģmateriāli!E19,\"\")","v":""},{"$f":"IF(ISNUMBER(Zāģmateriāli!E19),Zāģmateriāli!F19,\"\")","v":""},{"$f":"IF(ISTEXT(Zāģmateriāli!G19),Zāģmateriāli!G19,\"\")","v":""},""]
[{"$f":"IF(ISNUMBER(Zāģmateriāli!E20),Zāģmateriāli!A20,\"\")","v":""},{"$f":"IF(ISNUMBER(Zāģmateriāli!E20),Zāģmateriāli!B20,\"\")","v":""},{"$f":"IF(ISNUMBER(Zāģmateriāli!E20),Zāģmateriāli!C20,\"\")","v":""},{"$f":"IF(ISNUMBER(Zāģmateriāli!E20),Zāģmateriāli!D20,\"\")","v":""},{"$f":"IF(ISNUMBER(Zāģmateriāli!E20),Zāģmateriāli!E20,\"\")","v":""},{"$f":"IF(ISNUMBER(Zāģmateriāli!E20),Zāģmateriāli!F20,\"\")","v":""},{"$f":"IF(ISTEXT(Zāģmateriāli!G20),Zāģmateriāli!G20,\"\")","v":""},""]
[{"$f":"IF(ISNUMBER(Zāģmateriāli!E21),Zāģmateriāli!A21,\"\")","v":""},{"$f":"IF(ISNUMBER(Zāģmateriāli!E21),Zāģmateriāli!B21,\"\")","v":""},{"$f":"IF(ISNUMBER(Zāģmateriāli!E21),Zāģmateriāli!C21,\"\")","v":""},{"$f":"IF(ISNUMBER(Zāģmateriāli!E21),Zāģmateriāli!D21,\"\")","v":""},{"$f":"IF(ISNUMBER(Zāģmateriāli!E21),Zāģmateriāli!E21,\"\")","v":""},{"$f":"IF(ISNUMBER(Zāģmateriāli!E21),Zāģmateriāli!F21,\"\")","v":""},{"$f":"IF(ISTEXT(Zāģmateriāli!G21),Zāģmateriāli!G21,\"\")","v":""},""]
[{"$f":"IF(ISNUMBER(Zāģmateriāli!E22),Zāģmateriāli!A22,\"\")","v":""},{"$f":"IF(ISNUMBER(Zāģmateriāli!E22),Zāģmateriāli!B22,\"\")","v":""},{"$f":"IF(ISNUMBER(Zāģmateriāli!E22),Zāģmateriāli!C22,\"\")","v":""},{"$f":"IF(ISNUMBER(Zāģmateriāli!E22),Zāģmateriāli!D22,\"\")","v":""},{"$f":"IF(ISNUMBER(Zāģmateriāli!E22),Zāģmateriāli!E22,\"\")","v":""},{"$f":"IF(ISNUMBER(Zāģmateriāli!E22),Zāģmateriāli!F22,\"\")","v":""},{"$f":"IF(ISTEXT(Zāģmateriāli!G22),Zāģmateriāli!G22,\"\")","v":""},""]
[{"$f":"IF(ISNUMBER(Zāģmateriāli!E23),Zāģmateriāli!A23,\"\")","v":""},{"$f":"IF(ISNUMBER(Zāģmateriāli!E23),Zāģmateriāli!B23,\"\")","v":""},{"$f":"IF(ISNUMBER(Zāģmateriāli!E23),Zāģmateriāli!C23,\"\")","v":""},{"$f":"IF(ISNUMBER(Zāģmateriāli!E23),Zāģmateriāli!D23,\"\")","v":""},{"$f":"IF(ISNUMBER(Zāģmateriāli!E23),Zāģmateriāli!E23,\"\")","v":""},{"$f":"IF(ISNUMBER(Zāģmateriāli!E23),Zāģmateriāli!F23,\"\")","v":""},{"$f":"IF(ISTEXT(Zāģmateriāli!G23),Zāģmateriāli!G23,\"\")","v":""},""]
[{"$f":"IF(ISNUMBER(Zāģmateriāli!E24),Zāģmateriāli!A24,\"\")","v":""},{"$f":"IF(ISNUMBER(Zāģmateriāli!E24),Zāģmateriāli!B24,\"\")","v":""},{"$f":"IF(ISNUMBER(Zāģmateriāli!E24),Zāģmateriāli!C24,\"\")","v":""},{"$f":"IF(ISNUMBER(Zāģmateriāli!E24),Zāģmateriāli!D24,\"\")","v":""},{"$f":"IF(ISNUMBER(Zāģmateriāli!E24),Zāģmateriāli!E24,\"\")","v":""},{"$f":"IF(ISNUMBER(Zāģmateriāli!E24),Zāģmateriāli!F24,\"\")","v":""},{"$f":"IF(ISTEXT(Zāģmateriāli!G24),Zāģmateriāli!G24,\"\")","v":""},""]
[{"$f":"IF(ISNUMBER(Zāģmateriāli!E25),Zāģmateriāli!A25,\"\")","v":""},{"$f":"IF(ISNUMBER(Zāģmateriāli!E25),Zāģmateriāli!B25,\"\")","v":""},{"$f":"IF(ISNUMBER(Zāģmateriāli!E25),Zāģmateriāli!C25,\"\")","v":""},{"$f":"IF(ISNUMBER(Zāģmateriāli!E25),Zāģmateriāli!D25,\"\")","v":""},{"$f":"IF(ISNUMBER(Zāģmateriāli!E25),Zāģmateriāli!E25,\"\")","v":""},{"$f":"IF(ISNUMBER(Zāģmateriāli!E25),Zāģmateriāli!F25,\"\")","v":""},{"$f":"IF(ISTEXT(Zāģmateriāli!G25),Zāģmateriāli!G25,\"\")","v":""},""]
[{"$f":"IF(ISNUMBER(Zāģmateriāli!E26),Zāģmateriāli!A26,\"\")","v":""},{"$f":"IF(ISNUMBER(Zāģmateriāli!E26),Zāģmateriāli!B26,\"\")","v":""},{"$f":"IF(ISNUMBER(Zāģmateriāli!E26),Zāģmateriāli!C26,\"\")","v":""},{"$f":"IF(ISNUMBER(Zāģmateriāli!E26),Zāģmateriāli!D26,\"\")","v":""},{"$f":"IF(ISNUMBER(Zāģmateriāli!E26),Zāģmateriāli!E26,\"\")","v":""},{"$f":"IF(ISNUMBER(Zāģmateriāli!E26),Zāģmateriāli!F26,\"\")","v":""},{"$f":"IF(ISTEXT(Zāģmateriāli!G26),Zāģmateriāli!G26,\"\")","v":""},""]
[{"$f":"IF(ISNUMBER(Zāģmateriāli!E27),Zāģmateriāli!A27,\"\")","v":""},{"$f":"IF(ISNUMBER(Zāģmateriāli!E27),Zāģmateriāli!B27,\"\")","v":""},{"$f":"IF(ISNUMBER(Zāģmateriāli!E27),Zāģmateriāli!C27,\"\")","v":""},{"$f":"IF(ISNUMBER(Zāģmateriāli!E27),Zāģmateriāli!D27,\"\")","v":""},{"$f":"IF(ISNUMBER(Zāģmateriāli!E27),Zāģmateriāli!E27,\"\")","v":""},{"$f":"IF(ISNUMBER(Zāģmateriāli!E27),Zāģmateriāli!F27,\"\")","v":""},{"$f":"IF(ISTEXT(Zāģmateriāli!G27),Zāģmateriāli!G27,\"\")","v":""},""]
[{"$f":"IF(ISNUMBER(Zāģmateriāli!E28),Zāģmateriāli!A28,\"\")","v":""},{"$f":"IF(ISNUMBER(Zāģmateriāli!E28),Zāģmateriāli!B28,\"\")","v":""},{"$f":"IF(ISNUMBER(Zāģmateriāli!E28),Zāģmateriāli!C28,\"\")","v":""},{"$f":"IF(ISNUMBER(Zāģmateriāli!E28),Zāģmateriāli!D28,\"\")","v":""},{"$f":"IF(ISNUMBER(Zāģmateriāli!E28),Zāģmateriāli!E28,\"\")","v":""},{"$f":"IF(ISNUMBER(Zāģmateriāli!E28),Zāģmateriāli!F28,\"\")","v":""},{"$f":"IF(ISTEXT(Zāģmateriāli!G28),Zāģmateriāli!G28,\"\")","v":""},""]
[{"$f":"IF(ISNUMBER(Zāģmateriāli!E29),Zāģmateriāli!A29,\"\")","v":""},{"$f":"IF(ISNUMBER(Zāģmateriāli!E29),Zāģmateriāli!B29,\"\")","v":""},{"$f":"IF(ISNUMBER(Zāģmateriāli!E29),Zāģmateriāli!C29,\"\")","v":""},{"$f":"IF(ISNUMBER(Zāģmateriāli!E29),Zāģmateriāli!D29,\"\")","v":""},{"$f":"IF(ISNUMBER(Zāģmateriāli!E29),Zāģmateriāli!E29,\"\")","v":""},{"$f":"IF(ISNUMBER(Zāģmateriāli!E29),Zāģmateriāli!F29,\"\")","v":""},{"$f":"IF(ISTEXT(Zāģmateriāli!G29),Zāģmateriāli!G29,\"\")","v":""},""]
[{"$f":"IF(ISNUMBER(Zāģmateriāli!E30),Zāģmateriāli!A30,\"\")","v":""},{"$f":"IF(ISNUMBER(Zāģmateriāli!E30),Zāģmateriāli!B30,\"\")","v":""},{"$f":"IF(ISNUMBER(Zāģmateriāli!E30),Zāģmateriāli!C30,\"\")","v":""},{"$f":"IF(ISNUMBER(Zāģmateriāli!E30),Zāģmateriāli!D30,\"\")","v":""},{"$f":"IF(ISNUMBER(Zāģmateriāli!E30),Zāģmateriāli!E30,\"\")","v":""},{"$f":"IF(ISNUMBER(Zāģmateriāli!E30),Zāģmateriāli!F30,\"\")","v":""},{"$f":"IF(ISTEXT(Zāģmateriāli!G30),Zāģmateriāli!G30,\"\")","v":""},""]
[{"$f":"IF(ISNUMBER(Zāģmateriāli!E31),Zāģmateriāli!A31,\"\")","v":""},{"$f":"IF(ISNUMBER(Zāģmateriāli!E31),Zāģmateriāli!B31,\"\")","v":""},{"$f":"IF(ISNUMBER(Zāģmateriāli!E31),Zāģmateriāli!C31,\"\")","v":""},{"$f":"IF(ISNUMBER(Zāģmateriāli!E31),Zāģmateriāli!D31,\"\")","v":""},{"$f":"IF(ISNUMBER(Zāģmateriāli!E31),Zāģmateriāli!E31,\"\")","v":""},{"$f":"IF(ISNUMBER(Zāģmateriāli!E31),Zāģmateriāli!F31,\"\")","v":""},{"$f":"IF(ISTEXT(Zāģmateriāli!G31),Zāģmateriāli!G31,\"\")","v":""},""]
[{"$f":"IF(ISNUMBER(Zāģmateriāli!E32),Zāģmateriāli!A32,\"\")","v":""},{"$f":"IF(ISNUMBER(Zāģmateriāli!E32),Zāģmateriāli!B32,\"\")","v":""},{"$f":"IF(ISNUMBER(Zāģmateriāli!E32),Zāģmateriāli!C32,\"\")","v":""},{"$f":"IF(ISNUMBER(Zāģmateriāli!E32),Zāģmateriāli!D32,\"\")","v":""},{"$f":"IF(ISNUMBER(Zāģmateriāli!E32),Zāģmateriāli!E32,\"\")","v":""},{"$f":"IF(ISNUMBER(Zāģmateriāli!E32),Zāģmateriāli!F32,\"\")","v":""},{"$f":"IF(ISTEXT(Zāģmateriāli!G32),Zāģmateriāli!G32,\"\")","v":""},""]
[{"$f":"IF(ISNUMBER(Zāģmateriāli!E33),Zāģmateriāli!A33,\"\")","v":""},{"$f":"IF(ISNUMBER(Zāģmateriāli!E33),Zāģmateriāli!B33,\"\")","v":""},{"$f":"IF(ISNUMBER(Zāģmateriāli!E33),Zāģmateriāli!C33,\"\")","v":""},{"$f":"IF(ISNUMBER(Zāģmateriāli!E33),Zāģmateriāli!D33,\"\")","v":""},{"$f":"IF(ISNUMBER(Zāģmateriāli!E33),Zāģmateriāli!E33,\"\")","v":""},{"$f":"IF(ISNUMBER(Zāģmateriāli!E33),Zāģmateriāli!F33,\"\")","v":""},{"$f":"IF(ISTEXT(Zāģmateriāli!G33),Zāģmateriāli!G33,\"\")","v":""},""]
[{"$f":"IF(ISNUMBER(Zāģmateriāli!E34),Zāģmateriāli!A34,\"\")","v":""},{"$f":"IF(ISNUMBER(Zāģmateriāli!E34),Zāģmateriāli!B34,\"\")","v":""},{"$f":"IF(ISNUMBER(Zāģmateriāli!E34),Zāģmateriāli!C34,\"\")","v":""},{"$f":"IF(ISNUMBER(Zāģmateriāli!E34),Zāģmateriāli!D34,\"\")","v":""},{"$f":"IF(ISNUMBER(Zāģmateriāli!E34),Zāģmateriāli!E34,\"\")","v":""},{"$f":"IF(ISNUMBER(Zāģmateriāli!E34),Zāģmateriāli!F34,\"\")","v":""},{"$f":"IF(ISTEXT(Zāģmateriāli!G34),Zāģmateriāli!G34,\"\")","v":""},""]
[{"$f":"IF(ISNUMBER(Zāģmateriāli!E35),Zāģmateriāli!A35,\"\")","v":""},{"$f":"IF(ISNUMBER(Zāģmateriāli!E35),Zāģmateriāli!B35,\"\")","v":""},{"$f":"IF(ISNUMBER(Zāģmateriāli!E35),Zāģmateriāli!C35,\"\")","v":""},{"$f":"IF(ISNUMBER(Zāģmateriāli!E35),Zāģmateriāli!D35,\"\")","v":""},{"$f":"IF(ISNUMBER(Zāģmateriāli!E35),Zāģmateriāli!E35,\"\")","v":""},{"$f":"IF(ISNUMBER(Zāģmateriāli!E35),Zāģmateriāli!F35,\"\")","v":""},{"$f":"IF(ISTEXT(Zāģmateriāli!G35),Zāģmateriāli!G35,\"\")","v":""},""]
[{"$f":"IF(ISNUMBER(Zāģmateriāli!E36),Zāģmateriāli!A36,\"\")","v":""},{"$f":"IF(ISNUMBER(Zāģmateriāli!E36),Zāģmateriāli!B36,\"\")","v":""},{"$f":"IF(ISNUMBER(Zāģmateriāli!E36),Zāģmateriāli!C36,\"\")","v":""},{"$f":"IF(ISNUMBER(Zāģmateriāli!E36),Zāģmateriāli!D36,\"\")","v":""},{"$f":"IF(ISNUMBER(Zāģmateriāli!E36),Zāģmateriāli!E36,\"\")","v":""},{"$f":"IF(ISNUMBER(Zāģmateriāli!E36),Zāģmateriāli!F36,\"\")","v":""},{"$f":"IF(ISTEXT(Zāģmateriāli!G36),Zāģmateriāli!G36,\"\")","v":""},""]
[{"$f":"IF(ISNUMBER(Zāģmateriāli!E37),Zāģmateriāli!A37,\"\")","v":""},{"$f":"IF(ISNUMBER(Zāģmateriāli!E37),Zāģmateriāli!B37,\"\")","v":""},{"$f":"IF(ISNUMBER(Zāģmateriāli!E37),Zāģmateriāli!C37,\"\")","v":""},{"$f":"IF(ISNUMBER(Zāģmateriāli!E37),Zāģmateriāli!D37,\"\")","v":""},{"$f":"IF(ISNUMBER(Zāģmateriāli!E37),Zāģmateriāli!E37,\"\")","v":""},{"$f":"IF(ISNUMBER(Zāģmateriāli!E37),Zāģmateriāli!F37,\"\")","v":""},{"$f":"IF(ISTEXT(Zāģmateriāli!G37),Zāģmateriāli!G37,\"\")","v":""},""]
[{"$f":"IF(ISNUMBER(Zāģmateriāli!E38),Zāģmateriāli!A38,\"\")","v":""},{"$f":"IF(ISNUMBER(Zāģmateriāli!E38),Zāģmateriāli!B38,\"\")","v":""},{"$f":"IF(ISNUMBER(Zāģmateriāli!E38),Zāģmateriāli!C38,\"\")","v":""},{"$f":"IF(ISNUMBER(Zāģmateriāli!E38),Zāģmateriāli!D38,\"\")","v":""},{"$f":"IF(ISNUMBER(Zāģmateriāli!E38),Zāģmateriāli!E38,\"\")","v":""},{"$f":"IF(ISNUMBER(Zāģmateriāli!E38),Zāģmateriāli!F38,\"\")","v":""},{"$f":"IF(ISTEXT(Zāģmateriāli!G38),Zāģmateriāli!G38,\"\")","v":""},""]
[{"$f":"IF(ISNUMBER(Zāģmateriāli!E39),Zāģmateriāli!A39,\"\")","v":""},{"$f":"IF(ISNUMBER(Zāģmateriāli!E39),Zāģmateriāli!B39,\"\")","v":""},{"$f":"IF(ISNUMBER(Zāģmateriāli!E39),Zāģmateriāli!C39,\"\")","v":""},{"$f":"IF(ISNUMBER(Zāģmateriāli!E39),Zāģmateriāli!D39,\"\")","v":""},{"$f":"IF(ISNUMBER(Zāģmateriāli!E39),Zāģmateriāli!E39,\"\")","v":""},{"$f":"IF(ISNUMBER(Zāģmateriāli!E39),Zāģmateriāli!F39,\"\")","v":""},{"$f":"IF(ISTEXT(Zāģmateriāli!G39),Zāģmateriāli!G39,\"\")","v":""},""]
[{"$f":"IF(ISNUMBER(Zāģmateriāli!E40),Zāģmateriāli!A40,\"\")","v":""},{"$f":"IF(ISNUMBER(Zāģmateriāli!E40),Zāģmateriāli!B40,\"\")","v":""},{"$f":"IF(ISNUMBER(Zāģmateriāli!E40),Zāģmateriāli!C40,\"\")","v":""},{"$f":"IF(ISNUMBER(Zāģmateriāli!E40),Zāģmateriāli!D40,\"\")","v":""},{"$f":"IF(ISNUMBER(Zāģmateriāli!E40),Zāģmateriāli!E40,\"\")","v":""},{"$f":"IF(ISNUMBER(Zāģmateriāli!E40),Zāģmateriāli!F40,\"\")","v":""},{"$f":"IF(ISTEXT(Zāģmateriāli!G40),Zāģmateriāli!G40,\"\")","v":""},""]
[{"$f":"IF(ISNUMBER(Zāģmateriāli!E41),Zāģmateriāli!A41,\"\")","v":""},{"$f":"IF(ISNUMBER(Zāģmateriāli!E41),Zāģmateriāli!B41,\"\")","v":""},{"$f":"IF(ISNUMBER(Zāģmateriāli!E41),Zāģmateriāli!C41,\"\")","v":""},{"$f":"IF(ISNUMBER(Zāģmateriāli!E41),Zāģmateriāli!D41,\"\")","v":""},{"$f":"IF(ISNUMBER(Zāģmateriāli!E41),Zāģmateriāli!E41,\"\")","v":""},{"$f":"IF(ISNUMBER(Zāģmateriāli!E41),Zāģmateriāli!F41,\"\")","v":""},{"$f":"IF(ISTEXT(Zāģmateriāli!G41),Zāģmateriāli!G41,\"\")","v":""},""]
[{"$f":"IF(ISNUMBER(Zāģmateriāli!E42),Zāģmateriāli!A42,\"\")","v":""},{"$f":"IF(ISNUMBER(Zāģmateriāli!E42),Zāģmateriāli!B42,\"\")","v":""},{"$f":"IF(ISNUMBER(Zāģmateriāli!E42),Zāģmateriāli!C42,\"\")","v":""},{"$f":"IF(ISNUMBER(Zāģmateriāli!E42),Zāģmateriāli!D42,\"\")","v":""},{"$f":"IF(ISNUMBER(Zāģmateriāli!E42),Zāģmateriāli!E42,\"\")","v":""},{"$f":"IF(ISNUMBER(Zāģmateriāli!E42),Zāģmateriāli!F42,\"\")","v":""},{"$f":"IF(ISTEXT(Zāģmateriāli!G42),Zāģmateriāli!G42,\"\")","v":""},""]
[{"$f":"IF(ISNUMBER(Zāģmateriāli!E43),Zāģmateriāli!A43,\"\")","v":""},{"$f":"IF(ISNUMBER(Zāģmateriāli!E43),Zāģmateriāli!B43,\"\")","v":""},{"$f":"IF(ISNUMBER(Zāģmateriāli!E43),Zāģmateriāli!C43,\"\")","v":""},{"$f":"IF(ISNUMBER(Zāģmateriāli!E43),Zāģmateriāli!D43,\"\")","v":""},{"$f":"IF(ISNUMBER(Zāģmateriāli!E43),Zāģmateriāli!E43,\"\")","v":""},{"$f":"IF(ISNUMBER(Zāģmateriāli!E43),Zāģmateriāli!F43,\"\")","v":""},{"$f":"IF(ISTEXT(Zāģmateriāli!G43),Zāģmateriāli!G43,\"\")","v":""},""]
[{"$f":"IF(ISNUMBER(Zāģmateriāli!E44),Zāģmateriāli!A44,\"\")","v":""},{"$f":"IF(ISNUMBER(Zāģmateriāli!E44),Zāģmateriāli!B44,\"\")","v":""},{"$f":"IF(ISNUMBER(Zāģmateriāli!E44),Zāģmateriāli!C44,\"\")","v":""},{"$f":"IF(ISNUMBER(Zāģmateriāli!E44),Zāģmateriāli!D44,\"\")","v":""},{"$f":"IF(ISNUMBER(Zāģmateriāli!E44),Zāģmateriāli!E44,\"\")","v":""},{"$f":"IF(ISNUMBER(Zāģmateriāli!E44),Zāģmateriāli!F44,\"\")","v":""},{"$f":"IF(ISTEXT(Zāģmateriāli!G44),Zāģmateriāli!G44,\"\")","v":""},""]
[{"$f":"IF(ISNUMBER(Zāģmateriāli!E45),Zāģmateriāli!A45,\"\")","v":""},{"$f":"IF(ISNUMBER(Zāģmateriāli!E45),Zāģmateriāli!B45,\"\")","v":""},{"$f":"IF(ISNUMBER(Zāģmateriāli!E45),Zāģmateriāli!C45,\"\")","v":""},{"$f":"IF(ISNUMBER(Zāģmateriāli!E45),Zāģmateriāli!D45,\"\")","v":""},{"$f":"IF(ISNUMBER(Zāģmateriāli!E45),Zāģmateriāli!E45,\"\")","v":""},{"$f":"IF(ISNUMBER(Zāģmateriāli!E45),Zāģmateriāli!F45,\"\")","v":""},{"$f":"IF(ISTEXT(Zāģmateriāli!G45),Zāģmateriāli!G45,\"\")","v":""},""]
[{"$f":"IF(ISNUMBER(Zāģmateriāli!E46),Zāģmateriāli!A46,\"\")","v":""},{"$f":"IF(ISNUMBER(Zāģmateriāli!E46),Zāģmateriāli!B46,\"\")","v":""},{"$f":"IF(ISNUMBER(Zāģmateriāli!E46),Zāģmateriāli!C46,\"\")","v":""},{"$f":"IF(ISNUMBER(Zāģmateriāli!E46),Zāģmateriāli!D46,\"\")","v":""},{"$f":"IF(ISNUMBER(Zāģmateriāli!E46),Zāģmateriāli!E46,\"\")","v":""},{"$f":"IF(ISNUMBER(Zāģmateriāli!E46),Zāģmateriāli!F46,\"\")","v":""},{"$f":"IF(ISTEXT(Zāģmateriāli!G46),Zāģmateriāli!G46,\"\")","v":""},""]
[{"$f":"IF(ISNUMBER(Zāģmateriāli!E47),Zāģmateriāli!A47,\"\")","v":""},{"$f":"IF(ISNUMBER(Zāģmateriāli!E47),Zāģmateriāli!B47,\"\")","v":""},{"$f":"IF(ISNUMBER(Zāģmateriāli!E47),Zāģmateriāli!C47,\"\")","v":""},{"$f":"IF(ISNUMBER(Zāģmateriāli!E47),Zāģmateriāli!D47,\"\")","v":""},{"$f":"IF(ISNUMBER(Zāģmateriāli!E47),Zāģmateriāli!E47,\"\")","v":""},{"$f":"IF(ISNUMBER(Zāģmateriāli!E47),Zāģmateriāli!F47,\"\")","v":""},{"$f":"IF(ISTEXT(Zāģmateriāli!G47),Zāģmateriāli!G47,\"\")","v":""},""]
[{"$f":"IF(ISNUMBER(Zāģmateriāli!E48),Zāģmateriāli!A48,\"\")","v":""},{"$f":"IF(ISNUMBER(Zāģmateriāli!E48),Zāģmateriāli!B48,\"\")","v":""},{"$f":"IF(ISNUMBER(Zāģmateriāli!E48),Zāģmateriāli!C48,\"\")","v":""},{"$f":"IF(ISNUMBER(Zāģmateriāli!E48),Zāģmateriāli!D48,\"\")","v":""},{"$f":"IF(ISNUMBER(Zāģmateriāli!E48),Zāģmateriāli!E48,\"\")","v":""},{"$f":"IF(ISNUMBER(Zāģmateriāli!E48),Zāģmateriāli!F48,\"\")","v":""},{"$f":"IF(ISTEXT(Zāģmateriāli!G48),Zāģmateriāli!G48,\"\")","v":""},""]
[{"$f":"IF(ISNUMBER(Zāģmateriāli!E49),Zāģmateriāli!A49,\"\")","v":""},{"$f":"IF(ISNUMBER(Zāģmateriāli!E49),Zāģmateriāli!B49,\"\")","v":""},{"$f":"IF(ISNUMBER(Zāģmateriāli!E49),Zāģmateriāli!C49,\"\")","v":""},{"$f":"IF(ISNUMBER(Zāģmateriāli!E49),Zāģmateriāli!D49,\"\")","v":""},{"$f":"IF(ISNUMBER(Zāģmateriāli!E49),Zāģmateriāli!E49,\"\")","v":""},{"$f":"IF(ISNUMBER(Zāģmateriāli!E49),Zāģmateriāli!F49,\"\")","v":""},{"$f":"IF(ISTEXT(Zāģmateriāli!G49),Zāģmateriāli!G49,\"\")","v":""},""]
[{"$f":"IF(ISNUMBER(Zāģmateriāli!E50),Zāģmateriāli!A50,\"\")","v":""},{"$f":"IF(ISNUMBER(Zāģmateriāli!E50),Zāģmateriāli!B50,\"\")","v":""},{"$f":"IF(ISNUMBER(Zāģmateriāli!E50),Zāģmateriāli!C50,\"\")","v":""},{"$f":"IF(ISNUMBER(Zāģmateriāli!E50),Zāģmateriāli!D50,\"\")","v":""},{"$f":"IF(ISNUMBER(Zāģmateriāli!E50),Zāģmateriāli!E50,\"\")","v":""},{"$f":"IF(ISNUMBER(Zāģmateriāli!E50),Zāģmateriāli!F50,\"\")","v":""},{"$f":"IF(ISTEXT(Zāģmateriāli!G50),Zāģmateriāli!G50,\"\")","v":""},""]
[{"$f":"IF(ISNUMBER(Zāģmateriāli!E51),Zāģmateriāli!A51,\"\")","v":""},{"$f":"IF(ISNUMBER(Zāģmateriāli!E51),Zāģmateriāli!B51,\"\")","v":""},{"$f":"IF(ISNUMBER(Zāģmateriāli!E51),Zāģmateriāli!C51,\"\")","v":""},{"$f":"IF(ISNUMBER(Zāģmateriāli!E51),Zāģmateriāli!D51,\"\")","v":""},{"$f":"IF(ISNUMBER(Zāģmateriāli!E51),Zāģmateriāli!E51,\"\")","v":""},{"$f":"IF(ISNUMBER(Zāģmateriāli!E51),Zāģmateriāli!F51,\"\")","v":""},{"$f":"IF(ISTEXT(Zāģmateriāli!G51),Zāģmateriāli!G51,\"\")","v":""},""]
[{"$f":"IF(ISNUMBER(Zāģmateriāli!E52),Zāģmateriāli!A52,\"\")","v":""},{"$f":"IF(ISNUMBER(Zāģmateriāli!E52),Zāģmateriāli!B52,\"\")","v":""},{"$f":"IF(ISNUMBER(Zāģmateriāli!E52),Zāģmateriāli!C52,\"\")","v":""},{"$f":"IF(ISNUMBER(Zāģmateriāli!E52),Zāģmateriāli!D52,\"\")","v":""},{"$f":"IF(ISNUMBER(Zāģmateriāli!E52),Zāģmateriāli!E52,\"\")","v":""},{"$f":"IF(ISNUMBER(Zāģmateriāli!E52),Zāģmateriāli!F52,\"\")","v":""},{"$f":"IF(ISTEXT(Zāģmateriāli!G52),Zāģmateriāli!G52,\"\")","v":""},""]
[]
[]
[{"$f":"IF(ISNUMBER(Lokšņmateriāli!G4),Lokšņmateriāli!A4,\"\")","v":""},{"$f":"IF(ISNUMBER(Lokšņmateriāli!G4),Lokšņmateriāli!B4,\"\")","v":""},{"$f":"IF(ISNUMBER(Lokšņmateriāli!G4),Lokšņmateriāli!C4,\"\")","v":""},{"$f":"IF(ISNUMBER(Lokšņmateriāli!G4),Lokšņmateriāli!E4,\"\")","v":""},{"$f":"IF(ISNUMBER(Lokšņmateriāli!G4),Lokšņmateriāli!G4,\"\")","v":""},{"$f":"IF(ISNUMBER(Lokšņmateriāli!G4),Lokšņmateriāli!H4,\"\")","v":""},{"$f":"IF(ISTEXT(Lokšņmateriāli!I4),Lokšņmateriāli!I4,\"\")","v":""},{"$f":"IF(ISNUMBER(E223),\"yes\",\"\")","v":""}]
[{"$f":"IF(ISNUMBER(Lokšņmateriāli!G5),Lokšņmateriāli!A5,\"\")","v":""},{"$f":"IF(ISNUMBER(Lokšņmateriāli!G5),Lokšņmateriāli!B5,\"\")","v":""},{"$f":"IF(ISNUMBER(Lokšņmateriāli!G5),Lokšņmateriāli!C5,\"\")","v":""},{"$f":"IF(ISNUMBER(Lokšņmateriāli!G5),Lokšņmateriāli!E5,\"\")","v":""},{"$f":"IF(ISNUMBER(Lokšņmateriāli!G5),Lokšņmateriāli!G5,\"\")","v":""},{"$f":"IF(ISNUMBER(Lokšņmateriāli!G5),Lokšņmateriāli!H5,\"\")","v":""},{"$f":"IF(ISTEXT(Lokšņmateriāli!I5),Lokšņmateriāli!I5,\"\")","v":""},""]
[{"$f":"IF(ISNUMBER(Lokšņmateriāli!G6),Lokšņmateriāli!A6,\"\")","v":""},{"$f":"IF(ISNUMBER(Lokšņmateriāli!G6),Lokšņmateriāli!B6,\"\")","v":""},{"$f":"IF(ISNUMBER(Lokšņmateriāli!G6),Lokšņmateriāli!C6,\"\")","v":""},{"$f":"IF(ISNUMBER(Lokšņmateriāli!G6),Lokšņmateriāli!E6,\"\")","v":""},{"$f":"IF(ISNUMBER(Lokšņmateriāli!G6),Lokšņmateriāli!G6,\"\")","v":""},{"$f":"IF(ISNUMBER(Lokšņmateriāli!G6),Lokšņmateriāli!H6,\"\")","v":""},{"$f":"IF(ISTEXT(Lokšņmateriāli!I6),Lokšņmateriāli!I6,\"\")","v":""},""]
[{"$f":"IF(ISNUMBER(Lokšņmateriāli!G7),Lokšņmateriāli!A7,\"\")","v":""},{"$f":"IF(ISNUMBER(Lokšņmateriāli!G7),Lokšņmateriāli!B7,\"\")","v":""},{"$f":"IF(ISNUMBER(Lokšņmateriāli!G7),Lokšņmateriāli!C7,\"\")","v":""},{"$f":"IF(ISNUMBER(Lokšņmateriāli!G7),Lokšņmateriāli!E7,\"\")","v":""},{"$f":"IF(ISNUMBER(Lokšņmateriāli!G7),Lokšņmateriāli!G7,\"\")","v":""},{"$f":"IF(ISNUMBER(Lokšņmateriāli!G7),Lokšņmateriāli!H7,\"\")","v":""},{"$f":"IF(ISTEXT(Lokšņmateriāli!I7),Lokšņmateriāli!I7,\"\")","v":""},""]
[{"$f":"IF(ISNUMBER(Lokšņmateriāli!G8),Lokšņmateriāli!A8,\"\")","v":""},{"$f":"IF(ISNUMBER(Lokšņmateriāli!G8),Lokšņmateriāli!B8,\"\")","v":""},{"$f":"IF(ISNUMBER(Lokšņmateriāli!G8),Lokšņmateriāli!C8,\"\")","v":""},{"$f":"IF(ISNUMBER(Lokšņmateriāli!G8),Lokšņmateriāli!E8,\"\")","v":""},{"$f":"IF(ISNUMBER(Lokšņmateriāli!G8),Lokšņmateriāli!G8,\"\")","v":""},{"$f":"IF(ISNUMBER(Lokšņmateriāli!G8),Lokšņmateriāli!H8,\"\")","v":""},{"$f":"IF(ISTEXT(Lokšņmateriāli!I8),Lokšņmateriāli!I8,\"\")","v":""},""]
[{"$f":"IF(ISNUMBER(Lokšņmateriāli!G9),Lokšņmateriāli!A9,\"\")","v":""},{"$f":"IF(ISNUMBER(Lokšņmateriāli!G9),Lokšņmateriāli!B9,\"\")","v":""},{"$f":"IF(ISNUMBER(Lokšņmateriāli!G9),Lokšņmateriāli!C9,\"\")","v":""},{"$f":"IF(ISNUMBER(Lokšņmateriāli!G9),Lokšņmateriāli!E9,\"\")","v":""},{"$f":"IF(ISNUMBER(Lokšņmateriāli!G9),Lokšņmateriāli!G9,\"\")","v":""},{"$f":"IF(ISNUMBER(Lokšņmateriāli!G9),Lokšņmateriāli!H9,\"\")","v":""},{"$f":"IF(ISTEXT(Lokšņmateriāli!I9),Lokšņmateriāli!I9,\"\")","v":""},""]
[{"$f":"IF(ISNUMBER(Lokšņmateriāli!G10),Lokšņmateriāli!A10,\"\")","v":""},{"$f":"IF(ISNUMBER(Lokšņmateriāli!G10),Lokšņmateriāli!B10,\"\")","v":""},{"$f":"IF(ISNUMBER(Lokšņmateriāli!G10),Lokšņmateriāli!C10,\"\")","v":""},{"$f":"IF(ISNUMBER(Lokšņmateriāli!G10),Lokšņmateriāli!E10,\"\")","v":""},{"$f":"IF(ISNUMBER(Lokšņmateriāli!G10),Lokšņmateriāli!G10,\"\")","v":""},{"$f":"IF(ISNUMBER(Lokšņmateriāli!G10),Lokšņmateriāli!H10,\"\")","v":""},{"$f":"IF(ISTEXT(Lokšņmateriāli!I10),Lokšņmateriāli!I10,\"\")","v":""},""]
[{"$f":"IF(ISNUMBER(Lokšņmateriāli!G11),Lokšņmateriāli!A11,\"\")","v":""},{"$f":"IF(ISNUMBER(Lokšņmateriāli!G11),Lokšņmateriāli!B11,\"\")","v":""},{"$f":"IF(ISNUMBER(Lokšņmateriāli!G11),Lokšņmateriāli!C11,\"\")","v":""},{"$f":"IF(ISNUMBER(Lokšņmateriāli!G11),Lokšņmateriāli!E11,\"\")","v":""},{"$f":"IF(ISNUMBER(Lokšņmateriāli!G11),Lokšņmateriāli!G11,\"\")","v":""},{"$f":"IF(ISNUMBER(Lokšņmateriāli!G11),Lokšņmateriāli!H11,\"\")","v":""},{"$f":"IF(ISTEXT(Lokšņmateriāli!I11),Lokšņmateriāli!I11,\"\")","v":""},""]
[{"$f":"IF(ISNUMBER(Lokšņmateriāli!G12),Lokšņmateriāli!A12,\"\")","v":""},{"$f":"IF(ISNUMBER(Lokšņmateriāli!G12),Lokšņmateriāli!B12,\"\")","v":""},{"$f":"IF(ISNUMBER(Lokšņmateriāli!G12),Lokšņmateriāli!C12,\"\")","v":""},{"$f":"IF(ISNUMBER(Lokšņmateriāli!G12),Lokšņmateriāli!E12,\"\")","v":""},{"$f":"IF(ISNUMBER(Lokšņmateriāli!G12),Lokšņmateriāli!G12,\"\")","v":""},{"$f":"IF(ISNUMBER(Lokšņmateriāli!G12),Lokšņmateriāli!H12,\"\")","v":""},{"$f":"IF(ISTEXT(Lokšņmateriāli!I12),Lokšņmateriāli!I12,\"\")","v":""},""]
[{"$f":"IF(ISNUMBER(Lokšņmateriāli!G13),Lokšņmateriāli!A13,\"\")","v":""},{"$f":"IF(ISNUMBER(Lokšņmateriāli!G13),Lokšņmateriāli!B13,\"\")","v":""},{"$f":"IF(ISNUMBER(Lokšņmateriāli!G13),Lokšņmateriāli!C13,\"\")","v":""},{"$f":"IF(ISNUMBER(Lokšņmateriāli!G13),Lokšņmateriāli!E13,\"\")","v":""},{"$f":"IF(ISNUMBER(Lokšņmateriāli!G13),Lokšņmateriāli!G13,\"\")","v":""},{"$f":"IF(ISNUMBER(Lokšņmateriāli!G13),Lokšņmateriāli!H13,\"\")","v":""},{"$f":"IF(ISTEXT(Lokšņmateriāli!I13),Lokšņmateriāli!I13,\"\")","v":""},""]
[{"$f":"IF(ISNUMBER(Lokšņmateriāli!G14),Lokšņmateriāli!A14,\"\")","v":""},{"$f":"IF(ISNUMBER(Lokšņmateriāli!G14),Lokšņmateriāli!B14,\"\")","v":""},{"$f":"IF(ISNUMBER(Lokšņmateriāli!G14),Lokšņmateriāli!C14,\"\")","v":""},{"$f":"IF(ISNUMBER(Lokšņmateriāli!G14),Lokšņmateriāli!E14,\"\")","v":""},{"$f":"IF(ISNUMBER(Lokšņmateriāli!G14),Lokšņmateriāli!G14,\"\")","v":""},{"$f":"IF(ISNUMBER(Lokšņmateriāli!G14),Lokšņmateriāli!H14,\"\")","v":""},{"$f":"IF(ISTEXT(Lokšņmateriāli!I14),Lokšņmateriāli!I14,\"\")","v":""},""]
[{"$f":"IF(ISNUMBER(Lokšņmateriāli!G15),Lokšņmateriāli!A15,\"\")","v":""},{"$f":"IF(ISNUMBER(Lokšņmateriāli!G15),Lokšņmateriāli!B15,\"\")","v":""},{"$f":"IF(ISNUMBER(Lokšņmateriāli!G15),Lokšņmateriāli!C15,\"\")","v":""},{"$f":"IF(ISNUMBER(Lokšņmateriāli!G15),Lokšņmateriāli!E15,\"\")","v":""},{"$f":"IF(ISNUMBER(Lokšņmateriāli!G15),Lokšņmateriāli!G15,\"\")","v":""},{"$f":"IF(ISNUMBER(Lokšņmateriāli!G15),Lokšņmateriāli!H15,\"\")","v":""},{"$f":"IF(ISTEXT(Lokšņmateriāli!I15),Lokšņmateriāli!I15,\"\")","v":""},""]
[{"$f":"IF(ISNUMBER(Lokšņmateriāli!G16),Lokšņmateriāli!A16,\"\")","v":""},{"$f":"IF(ISNUMBER(Lokšņmateriāli!G16),Lokšņmateriāli!B16,\"\")","v":""},{"$f":"IF(ISNUMBER(Lokšņmateriāli!G16),Lokšņmateriāli!C16,\"\")","v":""},{"$f":"IF(ISNUMBER(Lokšņmateriāli!G16),Lokšņmateriāli!E16,\"\")","v":""},{"$f":"IF(ISNUMBER(Lokšņmateriāli!G16),Lokšņmateriāli!G16,\"\")","v":""},{"$f":"IF(ISNUMBER(Lokšņmateriāli!G16),Lokšņmateriāli!H16,\"\")","v":""},{"$f":"IF(ISTEXT(Lokšņmateriāli!I16),Lokšņmateriāli!I16,\"\")","v":""},""]
[{"$f":"IF(ISNUMBER(Lokšņmateriāli!G17),Lokšņmateriāli!A17,\"\")","v":""},{"$f":"IF(ISNUMBER(Lokšņmateriāli!G17),Lokšņmateriāli!B17,\"\")","v":""},{"$f":"IF(ISNUMBER(Lokšņmateriāli!G17),Lokšņmateriāli!C17,\"\")","v":""},{"$f":"IF(ISNUMBER(Lokšņmateriāli!G17),Lokšņmateriāli!E17,\"\")","v":""},{"$f":"IF(ISNUMBER(Lokšņmateriāli!G17),Lokšņmateriāli!G17,\"\")","v":""},{"$f":"IF(ISNUMBER(Lokšņmateriāli!G17),Lokšņmateriāli!H17,\"\")","v":""},{"$f":"IF(ISTEXT(Lokšņmateriāli!I17),Lokšņmateriāli!I17,\"\")","v":""},""]
[{"$f":"IF(ISNUMBER(Lokšņmateriāli!G18),Lokšņmateriāli!A18,\"\")","v":""},{"$f":"IF(ISNUMBER(Lokšņmateriāli!G18),Lokšņmateriāli!B18,\"\")","v":""},{"$f":"IF(ISNUMBER(Lokšņmateriāli!G18),Lokšņmateriāli!C18,\"\")","v":""},{"$f":"IF(ISNUMBER(Lokšņmateriāli!G18),Lokšņmateriāli!E18,\"\")","v":""},{"$f":"IF(ISNUMBER(Lokšņmateriāli!G18),Lokšņmateriāli!G18,\"\")","v":""},{"$f":"IF(ISNUMBER(Lokšņmateriāli!G18),Lokšņmateriāli!H18,\"\")","v":""},{"$f":"IF(ISTEXT(Lokšņmateriāli!I18),Lokšņmateriāli!I18,\"\")","v":""},""]
[{"$f":"IF(ISNUMBER(Lokšņmateriāli!G19),Lokšņmateriāli!A19,\"\")","v":""},{"$f":"IF(ISNUMBER(Lokšņmateriāli!G19),Lokšņmateriāli!B19,\"\")","v":""},{"$f":"IF(ISNUMBER(Lokšņmateriāli!G19),Lokšņmateriāli!C19,\"\")","v":""},{"$f":"IF(ISNUMBER(Lokšņmateriāli!G19),Lokšņmateriāli!E19,\"\")","v":""},{"$f":"IF(ISNUMBER(Lokšņmateriāli!G19),Lokšņmateriāli!G19,\"\")","v":""},{"$f":"IF(ISNUMBER(Lokšņmateriāli!G19),Lokšņmateriāli!H19,\"\")","v":""},{"$f":"IF(ISTEXT(Lokšņmateriāli!I19),Lokšņmateriāli!I19,\"\")","v":""},""]
[{"$f":"IF(ISNUMBER(Lokšņmateriāli!G20),Lokšņmateriāli!A20,\"\")","v":""},{"$f":"IF(ISNUMBER(Lokšņmateriāli!G20),Lokšņmateriāli!B20,\"\")","v":""},{"$f":"IF(ISNUMBER(Lokšņmateriāli!G20),Lokšņmateriāli!C20,\"\")","v":""},{"$f":"IF(ISNUMBER(Lokšņmateriāli!G20),Lokšņmateriāli!E20,\"\")","v":""},{"$f":"IF(ISNUMBER(Lokšņmateriāli!G20),Lokšņmateriāli!G20,\"\")","v":""},{"$f":"IF(ISNUMBER(Lokšņmateriāli!G20),Lokšņmateriāli!H20,\"\")","v":""},{"$f":"IF(ISTEXT(Lokšņmateriāli!I20),Lokšņmateriāli!I20,\"\")","v":""},""]
[{"$f":"IF(ISNUMBER(Lokšņmateriāli!G21),Lokšņmateriāli!A21,\"\")","v":""},{"$f":"IF(ISNUMBER(Lokšņmateriāli!G21),Lokšņmateriāli!B21,\"\")","v":""},{"$f":"IF(ISNUMBER(Lokšņmateriāli!G21),Lokšņmateriāli!C21,\"\")","v":""},{"$f":"IF(ISNUMBER(Lokšņmateriāli!G21),Lokšņmateriāli!E21,\"\")","v":""},{"$f":"IF(ISNUMBER(Lokšņmateriāli!G21),Lokšņmateriāli!G21,\"\")","v":""},{"$f":"IF(ISNUMBER(Lokšņmateriāli!G21),Lokšņmateriāli!H21,\"\")","v":""},{"$f":"IF(ISTEXT(Lokšņmateriāli!I21),Lokšņmateriāli!I21,\"\")","v":""},""]
[{"$f":"IF(ISNUMBER(Lokšņmateriāli!G22),Lokšņmateriāli!A22,\"\")","v":""},{"$f":"IF(ISNUMBER(Lokšņmateriāli!G22),Lokšņmateriāli!B22,\"\")","v":""},{"$f":"IF(ISNUMBER(Lokšņmateriāli!G22),Lokšņmateriāli!C22,\"\")","v":""},{"$f":"IF(ISNUMBER(Lokšņmateriāli!G22),Lokšņmateriāli!E22,\"\")","v":""},{"$f":"IF(ISNUMBER(Lokšņmateriāli!G22),Lokšņmateriāli!G22,\"\")","v":""},{"$f":"IF(ISNUMBER(Lokšņmateriāli!G22),Lokšņmateriāli!H22,\"\")","v":""},{"$f":"IF(ISTEXT(Lokšņmateriāli!I22),Lokšņmateriāli!I22,\"\")","v":""},""]
[{"$f":"IF(ISNUMBER(Lokšņmateriāli!G23),Lokšņmateriāli!A23,\"\")","v":""},{"$f":"IF(ISNUMBER(Lokšņmateriāli!G23),Lokšņmateriāli!B23,\"\")","v":""},{"$f":"IF(ISNUMBER(Lokšņmateriāli!G23),Lokšņmateriāli!C23,\"\")","v":""},{"$f":"IF(ISNUMBER(Lokšņmateriāli!G23),Lokšņmateriāli!E23,\"\")","v":""},{"$f":"IF(ISNUMBER(Lokšņmateriāli!G23),Lokšņmateriāli!G23,\"\")","v":""},{"$f":"IF(ISNUMBER(Lokšņmateriāli!G23),Lokšņmateriāli!H23,\"\")","v":""},{"$f":"IF(ISTEXT(Lokšņmateriāli!I23),Lokšņmateriāli!I23,\"\")","v":""},""]
[{"$f":"IF(ISNUMBER(Lokšņmateriāli!G24),Lokšņmateriāli!A24,\"\")","v":""},{"$f":"IF(ISNUMBER(Lokšņmateriāli!G24),Lokšņmateriāli!B24,\"\")","v":""},{"$f":"IF(ISNUMBER(Lokšņmateriāli!G24),Lokšņmateriāli!C24,\"\")","v":""},{"$f":"IF(ISNUMBER(Lokšņmateriāli!G24),Lokšņmateriāli!E24,\"\")","v":""},{"$f":"IF(ISNUMBER(Lokšņmateriāli!G24),Lokšņmateriāli!G24,\"\")","v":""},{"$f":"IF(ISNUMBER(Lokšņmateriāli!G24),Lokšņmateriāli!H24,\"\")","v":""},{"$f":"IF(ISTEXT(Lokšņmateriāli!I24),Lokšņmateriāli!I24,\"\")","v":""},""]
[{"$f":"IF(ISNUMBER(Lokšņmateriāli!G25),Lokšņmateriāli!A25,\"\")","v":""},{"$f":"IF(ISNUMBER(Lokšņmateriāli!G25),Lokšņmateriāli!B25,\"\")","v":""},{"$f":"IF(ISNUMBER(Lokšņmateriāli!G25),Lokšņmateriāli!C25,\"\")","v":""},{"$f":"IF(ISNUMBER(Lokšņmateriāli!G25),Lokšņmateriāli!E25,\"\")","v":""},{"$f":"IF(ISNUMBER(Lokšņmateriāli!G25),Lokšņmateriāli!G25,\"\")","v":""},{"$f":"IF(ISNUMBER(Lokšņmateriāli!G25),Lokšņmateriāli!H25,\"\")","v":""},{"$f":"IF(ISTEXT(Lokšņmateriāli!I25),Lokšņmateriāli!I25,\"\")","v":""},""]
[{"$f":"IF(ISNUMBER(Lokšņmateriāli!G26),Lokšņmateriāli!A26,\"\")","v":""},{"$f":"IF(ISNUMBER(Lokšņmateriāli!G26),Lokšņmateriāli!B26,\"\")","v":""},{"$f":"IF(ISNUMBER(Lokšņmateriāli!G26),Lokšņmateriāli!C26,\"\")","v":""},{"$f":"IF(ISNUMBER(Lokšņmateriāli!G26),Lokšņmateriāli!E26,\"\")","v":""},{"$f":"IF(ISNUMBER(Lokšņmateriāli!G26),Lokšņmateriāli!G26,\"\")","v":""},{"$f":"IF(ISNUMBER(Lokšņmateriāli!G26),Lokšņmateriāli!H26,\"\")","v":""},{"$f":"IF(ISTEXT(Lokšņmateriāli!I26),Lokšņmateriāli!I26,\"\")","v":""},""]
[{"$f":"IF(ISNUMBER(Lokšņmateriāli!G27),Lokšņmateriāli!A27,\"\")","v":""},{"$f":"IF(ISNUMBER(Lokšņmateriāli!G27),Lokšņmateriāli!B27,\"\")","v":""},{"$f":"IF(ISNUMBER(Lokšņmateriāli!G27),Lokšņmateriāli!C27,\"\")","v":""},{"$f":"IF(ISNUMBER(Lokšņmateriāli!G27),Lokšņmateriāli!E27,\"\")","v":""},{"$f":"IF(ISNUMBER(Lokšņmateriāli!G27),Lokšņmateriāli!G27,\"\")","v":""},{"$f":"IF(ISNUMBER(Lokšņmateriāli!G27),Lokšņmateriāli!H27,\"\")","v":""},{"$f":"IF(ISTEXT(Lokšņmateriāli!I27),Lokšņmateriāli!I27,\"\")","v":""},""]
[{"$f":"IF(ISNUMBER(Lokšņmateriāli!G28),Lokšņmateriāli!A28,\"\")","v":""},{"$f":"IF(ISNUMBER(Lokšņmateriāli!G28),Lokšņmateriāli!B28,\"\")","v":""},{"$f":"IF(ISNUMBER(Lokšņmateriāli!G28),Lokšņmateriāli!C28,\"\")","v":""},{"$f":"IF(ISNUMBER(Lokšņmateriāli!G28),Lokšņmateriāli!E28,\"\")","v":""},{"$f":"IF(ISNUMBER(Lokšņmateriāli!G28),Lokšņmateriāli!G28,\"\")","v":""},{"$f":"IF(ISNUMBER(Lokšņmateriāli!G28),Lokšņmateriāli!H28,\"\")","v":""},{"$f":"IF(ISTEXT(Lokšņmateriāli!I28),Lokšņmateriāli!I28,\"\")","v":""},""]
[{"$f":"IF(ISNUMBER(Lokšņmateriāli!G29),Lokšņmateriāli!A29,\"\")","v":""},{"$f":"IF(ISNUMBER(Lokšņmateriāli!G29),Lokšņmateriāli!B29,\"\")","v":""},{"$f":"IF(ISNUMBER(Lokšņmateriāli!G29),Lokšņmateriāli!C29,\"\")","v":""},{"$f":"IF(ISNUMBER(Lokšņmateriāli!G29),Lokšņmateriāli!E29,\"\")","v":""},{"$f":"IF(ISNUMBER(Lokšņmateriāli!G29),Lokšņmateriāli!G29,\"\")","v":""},{"$f":"IF(ISNUMBER(Lokšņmateriāli!G29),Lokšņmateriāli!H29,\"\")","v":""},{"$f":"IF(ISTEXT(Lokšņmateriāli!I29),Lokšņmateriāli!I29,\"\")","v":""},""]
[{"$f":"IF(ISNUMBER(Lokšņmateriāli!G30),Lokšņmateriāli!A30,\"\")","v":""},{"$f":"IF(ISNUMBER(Lokšņmateriāli!G30),Lokšņmateriāli!B30,\"\")","v":""},{"$f":"IF(ISNUMBER(Lokšņmateriāli!G30),Lokšņmateriāli!C30,\"\")","v":""},{"$f":"IF(ISNUMBER(Lokšņmateriāli!G30),Lokšņmateriāli!E30,\"\")","v":""},{"$f":"IF(ISNUMBER(Lokšņmateriāli!G30),Lokšņmateriāli!G30,\"\")","v":""},{"$f":"IF(ISNUMBER(Lokšņmateriāli!G30),Lokšņmateriāli!H30,\"\")","v":""},{"$f":"IF(ISTEXT(Lokšņmateriāli!I30),Lokšņmateriāli!I30,\"\")","v":""},""]
[{"$f":"IF(ISNUMBER(Lokšņmateriāli!G31),Lokšņmateriāli!A31,\"\")","v":""},{"$f":"IF(ISNUMBER(Lokšņmateriāli!G31),Lokšņmateriāli!B31,\"\")","v":""},{"$f":"IF(ISNUMBER(Lokšņmateriāli!G31),Lokšņmateriāli!C31,\"\")","v":""},{"$f":"IF(ISNUMBER(Lokšņmateriāli!G31),Lokšņmateriāli!E31,\"\")","v":""},{"$f":"IF(ISNUMBER(Lokšņmateriāli!G31),Lokšņmateriāli!G31,\"\")","v":""},{"$f":"IF(ISNUMBER(Lokšņmateriāli!G31),Lokšņmateriāli!H31,\"\")","v":""},{"$f":"IF(ISTEXT(Lokšņmateriāli!I31),Lokšņmateriāli!I31,\"\")","v":""},""]
[{"$f":"IF(ISNUMBER(Lokšņmateriāli!G32),Lokšņmateriāli!A32,\"\")","v":""},{"$f":"IF(ISNUMBER(Lokšņmateriāli!G32),Lokšņmateriāli!B32,\"\")","v":""},{"$f":"IF(ISNUMBER(Lokšņmateriāli!G32),Lokšņmateriāli!C32,\"\")","v":""},{"$f":"IF(ISNUMBER(Lokšņmateriāli!G32),Lokšņmateriāli!E32,\"\")","v":""},{"$f":"IF(ISNUMBER(Lokšņmateriāli!G32),Lokšņmateriāli!G32,\"\")","v":""},{"$f":"IF(ISNUMBER(Lokšņmateriāli!G32),Lokšņmateriāli!H32,\"\")","v":""},{"$f":"IF(ISTEXT(Lokšņmateriāli!I32),Lokšņmateriāli!I32,\"\")","v":""},""]
[{"$f":"IF(ISNUMBER(Lokšņmateriāli!G33),Lokšņmateriāli!A33,\"\")","v":""},{"$f":"IF(ISNUMBER(Lokšņmateriāli!G33),Lokšņmateriāli!B33,\"\")","v":""},{"$f":"IF(ISNUMBER(Lokšņmateriāli!G33),Lokšņmateriāli!C33,\"\")","v":""},{"$f":"IF(ISNUMBER(Lokšņmateriāli!G33),Lokšņmateriāli!E33,\"\")","v":""},{"$f":"IF(ISNUMBER(Lokšņmateriāli!G33),Lokšņmateriāli!G33,\"\")","v":""},{"$f":"IF(ISNUMBER(Lokšņmateriāli!G33),Lokšņmateriāli!H33,\"\")","v":""},{"$f":"IF(ISTEXT(Lokšņmateriāli!I33),Lokšņmateriāli!I33,\"\")","v":""},""]
[{"$f":"IF(ISNUMBER(Lokšņmateriāli!G34),Lokšņmateriāli!A34,\"\")","v":""},{"$f":"IF(ISNUMBER(Lokšņmateriāli!G34),Lokšņmateriāli!B34,\"\")","v":""},{"$f":"IF(ISNUMBER(Lokšņmateriāli!G34),Lokšņmateriāli!C34,\"\")","v":""},{"$f":"IF(ISNUMBER(Lokšņmateriāli!G34),Lokšņmateriāli!E34,\"\")","v":""},{"$f":"IF(ISNUMBER(Lokšņmateriāli!G34),Lokšņmateriāli!G34,\"\")","v":""},{"$f":"IF(ISNUMBER(Lokšņmateriāli!G34),Lokšņmateriāli!H34,\"\")","v":""},{"$f":"IF(ISTEXT(Lokšņmateriāli!I34),Lokšņmateriāli!I34,\"\")","v":""},""]
[{"$f":"IF(ISNUMBER(Lokšņmateriāli!G35),Lokšņmateriāli!A35,\"\")","v":""},{"$f":"IF(ISNUMBER(Lokšņmateriāli!G35),Lokšņmateriāli!B35,\"\")","v":""},{"$f":"IF(ISNUMBER(Lokšņmateriāli!G35),Lokšņmateriāli!C35,\"\")","v":""},{"$f":"IF(ISNUMBER(Lokšņmateriāli!G35),Lokšņmateriāli!E35,\"\")","v":""},{"$f":"IF(ISNUMBER(Lokšņmateriāli!G35),Lokšņmateriāli!G35,\"\")","v":""},{"$f":"IF(ISNUMBER(Lokšņmateriāli!G35),Lokšņmateriāli!H35,\"\")","v":""},{"$f":"IF(ISTEXT(Lokšņmateriāli!I35),Lokšņmateriāli!I35,\"\")","v":""},""]
[{"$f":"IF(ISNUMBER(Lokšņmateriāli!G36),Lokšņmateriāli!A36,\"\")","v":""},{"$f":"IF(ISNUMBER(Lokšņmateriāli!G36),Lokšņmateriāli!B36,\"\")","v":""},{"$f":"IF(ISNUMBER(Lokšņmateriāli!G36),Lokšņmateriāli!C36,\"\")","v":""},{"$f":"IF(ISNUMBER(Lokšņmateriāli!G36),Lokšņmateriāli!E36,\"\")","v":""},{"$f":"IF(ISNUMBER(Lokšņmateriāli!G36),Lokšņmateriāli!G36,\"\")","v":""},{"$f":"IF(ISNUMBER(Lokšņmateriāli!G36),Lokšņmateriāli!H36,\"\")","v":""},{"$f":"IF(ISTEXT(Lokšņmateriāli!I36),Lokšņmateriāli!I36,\"\")","v":""},""]
[{"$f":"IF(ISNUMBER(Lokšņmateriāli!G37),Lokšņmateriāli!A37,\"\")","v":""},{"$f":"IF(ISNUMBER(Lokšņmateriāli!G37),Lokšņmateriāli!B37,\"\")","v":""},{"$f":"IF(ISNUMBER(Lokšņmateriāli!G37),Lokšņmateriāli!C37,\"\")","v":""},{"$f":"IF(ISNUMBER(Lokšņmateriāli!G37),Lokšņmateriāli!E37,\"\")","v":""},{"$f":"IF(ISNUMBER(Lokšņmateriāli!G37),Lokšņmateriāli!G37,\"\")","v":""},{"$f":"IF(ISNUMBER(Lokšņmateriāli!G37),Lokšņmateriāli!H37,\"\")","v":""},{"$f":"IF(ISTEXT(Lokšņmateriāli!I37),Lokšņmateriāli!I37,\"\")","v":""},""]
[{"$f":"IF(ISNUMBER(Lokšņmateriāli!G38),Lokšņmateriāli!A38,\"\")","v":""},{"$f":"IF(ISNUMBER(Lokšņmateriāli!G38),Lokšņmateriāli!B38,\"\")","v":""},{"$f":"IF(ISNUMBER(Lokšņmateriāli!G38),Lokšņmateriāli!C38,\"\")","v":""},{"$f":"IF(ISNUMBER(Lokšņmateriāli!G38),Lokšņmateriāli!E38,\"\")","v":""},{"$f":"IF(ISNUMBER(Lokšņmateriāli!G38),Lokšņmateriāli!G38,\"\")","v":""},{"$f":"IF(ISNUMBER(Lokšņmateriāli!G38),Lokšņmateriāli!H38,\"\")","v":""},{"$f":"IF(ISTEXT(Lokšņmateriāli!I38),Lokšņmateriāli!I38,\"\")","v":""},""]
[{"$f":"IF(ISNUMBER(Lokšņmateriāli!G39),Lokšņmateriāli!A39,\"\")","v":""},{"$f":"IF(ISNUMBER(Lokšņmateriāli!G39),Lokšņmateriāli!B39,\"\")","v":""},{"$f":"IF(ISNUMBER(Lokšņmateriāli!G39),Lokšņmateriāli!C39,\"\")","v":""},{"$f":"IF(ISNUMBER(Lokšņmateriāli!G39),Lokšņmateriāli!E39,\"\")","v":""},{"$f":"IF(ISNUMBER(Lokšņmateriāli!G39),Lokšņmateriāli!G39,\"\")","v":""},{"$f":"IF(ISNUMBER(Lokšņmateriāli!G39),Lokšņmateriāli!H39,\"\")","v":""},{"$f":"IF(ISTEXT(Lokšņmateriāli!I39),Lokšņmateriāli!I39,\"\")","v":""},""]
[{"$f":"IF(ISNUMBER(Lokšņmateriāli!G40),Lokšņmateriāli!A40,\"\")","v":""},{"$f":"IF(ISNUMBER(Lokšņmateriāli!G40),Lokšņmateriāli!B40,\"\")","v":""},{"$f":"IF(ISNUMBER(Lokšņmateriāli!G40),Lokšņmateriāli!C40,\"\")","v":""},{"$f":"IF(ISNUMBER(Lokšņmateriāli!G40),Lokšņmateriāli!E40,\"\")","v":""},{"$f":"IF(ISNUMBER(Lokšņmateriāli!G40),Lokšņmateriāli!G40,\"\")","v":""},{"$f":"IF(ISNUMBER(Lokšņmateriāli!G40),Lokšņmateriāli!H40,\"\")","v":""},{"$f":"IF(ISTEXT(Lokšņmateriāli!I40),Lokšņmateriāli!I40,\"\")","v":""},""]
[{"$f":"IF(ISNUMBER(Lokšņmateriāli!G41),Lokšņmateriāli!A41,\"\")","v":""},{"$f":"IF(ISNUMBER(Lokšņmateriāli!G41),Lokšņmateriāli!B41,\"\")","v":""},{"$f":"IF(ISNUMBER(Lokšņmateriāli!G41),Lokšņmateriāli!C41,\"\")","v":""},{"$f":"IF(ISNUMBER(Lokšņmateriāli!G41),Lokšņmateriāli!E41,\"\")","v":""},{"$f":"IF(ISNUMBER(Lokšņmateriāli!G41),Lokšņmateriāli!G41,\"\")","v":""},{"$f":"IF(ISNUMBER(Lokšņmateriāli!G41),Lokšņmateriāli!H41,\"\")","v":""},{"$f":"IF(ISTEXT(Lokšņmateriāli!I41),Lokšņmateriāli!I41,\"\")","v":""},""]
[{"$f":"IF(ISNUMBER(Lokšņmateriāli!G42),Lokšņmateriāli!A42,\"\")","v":""},{"$f":"IF(ISNUMBER(Lokšņmateriāli!G42),Lokšņmateriāli!B42,\"\")","v":""},{"$f":"IF(ISNUMBER(Lokšņmateriāli!G42),Lokšņmateriāli!C42,\"\")","v":""},{"$f":"IF(ISNUMBER(Lokšņmateriāli!G42),Lokšņmateriāli!E42,\"\")","v":""},{"$f":"IF(ISNUMBER(Lokšņmateriāli!G42),Lokšņmateriāli!G42,\"\")","v":""},{"$f":"IF(ISNUMBER(Lokšņmateriāli!G42),Lokšņmateriāli!H42,\"\")","v":""},{"$f":"IF(ISTEXT(Lokšņmateriāli!I42),Lokšņmateriāli!I42,\"\")","v":""},""]
[{"$f":"IF(ISNUMBER(Lokšņmateriāli!G43),Lokšņmateriāli!A43,\"\")","v":""},{"$f":"IF(ISNUMBER(Lokšņmateriāli!G43),Lokšņmateriāli!B43,\"\")","v":""},{"$f":"IF(ISNUMBER(Lokšņmateriāli!G43),Lokšņmateriāli!C43,\"\")","v":""},{"$f":"IF(ISNUMBER(Lokšņmateriāli!G43),Lokšņmateriāli!E43,\"\")","v":""},{"$f":"IF(ISNUMBER(Lokšņmateriāli!G43),Lokšņmateriāli!G43,\"\")","v":""},{"$f":"IF(ISNUMBER(Lokšņmateriāli!G43),Lokšņmateriāli!H43,\"\")","v":""},{"$f":"IF(ISTEXT(Lokšņmateriāli!I43),Lokšņmateriāli!I43,\"\")","v":""},""]
[{"$f":"IF(ISNUMBER(Lokšņmateriāli!G44),Lokšņmateriāli!A44,\"\")","v":""},{"$f":"IF(ISNUMBER(Lokšņmateriāli!G44),Lokšņmateriāli!B44,\"\")","v":""},{"$f":"IF(ISNUMBER(Lokšņmateriāli!G44),Lokšņmateriāli!C44,\"\")","v":""},{"$f":"IF(ISNUMBER(Lokšņmateriāli!G44),Lokšņmateriāli!E44,\"\")","v":""},{"$f":"IF(ISNUMBER(Lokšņmateriāli!G44),Lokšņmateriāli!G44,\"\")","v":""},{"$f":"IF(ISNUMBER(Lokšņmateriāli!G44),Lokšņmateriāli!H44,\"\")","v":""},{"$f":"IF(ISTEXT(Lokšņmateriāli!I44),Lokšņmateriāli!I44,\"\")","v":""},""]
[{"$f":"IF(ISNUMBER(Lokšņmateriāli!G45),Lokšņmateriāli!A45,\"\")","v":""},{"$f":"IF(ISNUMBER(Lokšņmateriāli!G45),Lokšņmateriāli!B45,\"\")","v":""},{"$f":"IF(ISNUMBER(Lokšņmateriāli!G45),Lokšņmateriāli!C45,\"\")","v":""},{"$f":"IF(ISNUMBER(Lokšņmateriāli!G45),Lokšņmateriāli!E45,\"\")","v":""},{"$f":"IF(ISNUMBER(Lokšņmateriāli!G45),Lokšņmateriāli!G45,\"\")","v":""},{"$f":"IF(ISNUMBER(Lokšņmateriāli!G45),Lokšņmateriāli!H45,\"\")","v":""},{"$f":"IF(ISTEXT(Lokšņmateriāli!I45),Lokšņmateriāli!I45,\"\")","v":""},""]
[{"$f":"IF(ISNUMBER(Lokšņmateriāli!G46),Lokšņmateriāli!A46,\"\")","v":""},{"$f":"IF(ISNUMBER(Lokšņmateriāli!G46),Lokšņmateriāli!B46,\"\")","v":""},{"$f":"IF(ISNUMBER(Lokšņmateriāli!G46),Lokšņmateriāli!C46,\"\")","v":""},{"$f":"IF(ISNUMBER(Lokšņmateriāli!G46),Lokšņmateriāli!E46,\"\")","v":""},{"$f":"IF(ISNUMBER(Lokšņmateriāli!G46),Lokšņmateriāli!G46,\"\")","v":""},{"$f":"IF(ISNUMBER(Lokšņmateriāli!G46),Lokšņmateriāli!H46,\"\")","v":""},{"$f":"IF(ISTEXT(Lokšņmateriāli!I46),Lokšņmateriāli!I46,\"\")","v":""},""]
[{"$f":"IF(ISNUMBER(Lokšņmateriāli!G47),Lokšņmateriāli!A47,\"\")","v":""},{"$f":"IF(ISNUMBER(Lokšņmateriāli!G47),Lokšņmateriāli!B47,\"\")","v":""},{"$f":"IF(ISNUMBER(Lokšņmateriāli!G47),Lokšņmateriāli!C47,\"\")","v":""},{"$f":"IF(ISNUMBER(Lokšņmateriāli!G47),Lokšņmateriāli!E47,\"\")","v":""},{"$f":"IF(ISNUMBER(Lokšņmateriāli!G47),Lokšņmateriāli!G47,\"\")","v":""},{"$f":"IF(ISNUMBER(Lokšņmateriāli!G47),Lokšņmateriāli!H47,\"\")","v":""},{"$f":"IF(ISTEXT(Lokšņmateriāli!I47),Lokšņmateriāli!I47,\"\")","v":""},""]
[{"$f":"IF(ISNUMBER(Lokšņmateriāli!G48),Lokšņmateriāli!A48,\"\")","v":""},{"$f":"IF(ISNUMBER(Lokšņmateriāli!G48),Lokšņmateriāli!B48,\"\")","v":""},{"$f":"IF(ISNUMBER(Lokšņmateriāli!G48),Lokšņmateriāli!C48,\"\")","v":""},{"$f":"IF(ISNUMBER(Lokšņmateriāli!G48),Lokšņmateriāli!E48,\"\")","v":""},{"$f":"IF(ISNUMBER(Lokšņmateriāli!G48),Lokšņmateriāli!G48,\"\")","v":""},{"$f":"IF(ISNUMBER(Lokšņmateriāli!G48),Lokšņmateriāli!H48,\"\")","v":""},{"$f":"IF(ISTEXT(Lokšņmateriāli!I48),Lokšņmateriāli!I48,\"\")","v":""},""]
[{"$f":"IF(ISNUMBER(Lokšņmateriāli!G49),Lokšņmateriāli!A49,\"\")","v":""},{"$f":"IF(ISNUMBER(Lokšņmateriāli!G49),Lokšņmateriāli!B49,\"\")","v":""},{"$f":"IF(ISNUMBER(Lokšņmateriāli!G49),Lokšņmateriāli!C49,\"\")","v":""},{"$f":"IF(ISNUMBER(Lokšņmateriāli!G49),Lokšņmateriāli!E49,\"\")","v":""},{"$f":"IF(ISNUMBER(Lokšņmateriāli!G49),Lokšņmateriāli!G49,\"\")","v":""},{"$f":"IF(ISNUMBER(Lokšņmateriāli!G49),Lokšņmateriāli!H49,\"\")","v":""},{"$f":"IF(ISTEXT(Lokšņmateriāli!I49),Lokšņmateriāli!I49,\"\")","v":""},""]
[{"$f":"IF(ISNUMBER(Lokšņmateriāli!G50),Lokšņmateriāli!A50,\"\")","v":""},{"$f":"IF(ISNUMBER(Lokšņmateriāli!G50),Lokšņmateriāli!B50,\"\")","v":""},{"$f":"IF(ISNUMBER(Lokšņmateriāli!G50),Lokšņmateriāli!C50,\"\")","v":""},{"$f":"IF(ISNUMBER(Lokšņmateriāli!G50),Lokšņmateriāli!E50,\"\")","v":""},{"$f":"IF(ISNUMBER(Lokšņmateriāli!G50),Lokšņmateriāli!G50,\"\")","v":""},{"$f":"IF(ISNUMBER(Lokšņmateriāli!G50),Lokšņmateriāli!H50,\"\")","v":""},{"$f":"IF(ISTEXT(Lokšņmateriāli!I50),Lokšņmateriāli!I50,\"\")","v":""},""]
[{"$f":"IF(ISNUMBER(Lokšņmateriāli!G51),Lokšņmateriāli!A51,\"\")","v":""},{"$f":"IF(ISNUMBER(Lokšņmateriāli!G51),Lokšņmateriāli!B51,\"\")","v":""},{"$f":"IF(ISNUMBER(Lokšņmateriāli!G51),Lokšņmateriāli!C51,\"\")","v":""},{"$f":"IF(ISNUMBER(Lokšņmateriāli!G51),Lokšņmateriāli!E51,\"\")","v":""},{"$f":"IF(ISNUMBER(Lokšņmateriāli!G51),Lokšņmateriāli!G51,\"\")","v":""},{"$f":"IF(ISNUMBER(Lokšņmateriāli!G51),Lokšņmateriāli!H51,\"\")","v":""},{"$f":"IF(ISTEXT(Lokšņmateriāli!I51),Lokšņmateriāli!I51,\"\")","v":""},""]
[{"$f":"IF(ISNUMBER(Lokšņmateriāli!G52),Lokšņmateriāli!A52,\"\")","v":""},{"$f":"IF(ISNUMBER(Lokšņmateriāli!G52),Lokšņmateriāli!B52,\"\")","v":""},{"$f":"IF(ISNUMBER(Lokšņmateriāli!G52),Lokšņmateriāli!C52,\"\")","v":""},{"$f":"IF(ISNUMBER(Lokšņmateriāli!G52),Lokšņmateriāli!E52,\"\")","v":""},{"$f":"IF(ISNUMBER(Lokšņmateriāli!G52),Lokšņmateriāli!G52,\"\")","v":""},{"$f":"IF(ISNUMBER(Lokšņmateriāli!G52),Lokšņmateriāli!H52,\"\")","v":""},{"$f":"IF(ISTEXT(Lokšņmateriāli!I52),Lokšņmateriāli!I52,\"\")","v":""},""]
[{"$f":"IF(ISNUMBER(Lokšņmateriāli!G53),Lokšņmateriāli!A53,\"\")","v":""},{"$f":"IF(ISNUMBER(Lokšņmateriāli!G53),Lokšņmateriāli!B53,\"\")","v":""},{"$f":"IF(ISNUMBER(Lokšņmateriāli!G53),Lokšņmateriāli!C53,\"\")","v":""},{"$f":"IF(ISNUMBER(Lokšņmateriāli!G53),Lokšņmateriāli!E53,\"\")","v":""},{"$f":"IF(ISNUMBER(Lokšņmateriāli!G53),Lokšņmateriāli!G53,\"\")","v":""},{"$f":"IF(ISNUMBER(Lokšņmateriāli!G53),Lokšņmateriāli!H53,\"\")","v":""},{"$f":"IF(ISTEXT(Lokšņmateriāli!I53),Lokšņmateriāli!I53,\"\")","v":""},""]
[{"$f":"IF(ISNUMBER(Lokšņmateriāli!G54),Lokšņmateriāli!A54,\"\")","v":""},{"$f":"IF(ISNUMBER(Lokšņmateriāli!G54),Lokšņmateriāli!B54,\"\")","v":""},{"$f":"IF(ISNUMBER(Lokšņmateriāli!G54),Lokšņmateriāli!C54,\"\")","v":""},{"$f":"IF(ISNUMBER(Lokšņmateriāli!G54),Lokšņmateriāli!E54,\"\")","v":""},{"$f":"IF(ISNUMBER(Lokšņmateriāli!G54),Lokšņmateriāli!G54,\"\")","v":""},{"$f":"IF(ISNUMBER(Lokšņmateriāli!G54),Lokšņmateriāli!H54,\"\")","v":""},{"$f":"IF(ISTEXT(Lokšņmateriāli!I54),Lokšņmateriāli!I54,\"\")","v":""},""]
[{"$f":"IF(ISNUMBER(Lokšņmateriāli!G55),Lokšņmateriāli!A55,\"\")","v":""},{"$f":"IF(ISNUMBER(Lokšņmateriāli!G55),Lokšņmateriāli!B55,\"\")","v":""},{"$f":"IF(ISNUMBER(Lokšņmateriāli!G55),Lokšņmateriāli!C55,\"\")","v":""},{"$f":"IF(ISNUMBER(Lokšņmateriāli!G55),Lokšņmateriāli!E55,\"\")","v":""},{"$f":"IF(ISNUMBER(Lokšņmateriāli!G55),Lokšņmateriāli!G55,\"\")","v":""},{"$f":"IF(ISNUMBER(Lokšņmateriāli!G55),Lokšņmateriāli!H55,\"\")","v":""},{"$f":"IF(ISTEXT(Lokšņmateriāli!I55),Lokšņmateriāli!I55,\"\")","v":""},""]
[{"$f":"IF(ISNUMBER(Lokšņmateriāli!G56),Lokšņmateriāli!A56,\"\")","v":""},{"$f":"IF(ISNUMBER(Lokšņmateriāli!G56),Lokšņmateriāli!B56,\"\")","v":""},{"$f":"IF(ISNUMBER(Lokšņmateriāli!G56),Lokšņmateriāli!C56,\"\")","v":""},{"$f":"IF(ISNUMBER(Lokšņmateriāli!G56),Lokšņmateriāli!E56,\"\")","v":""},{"$f":"IF(ISNUMBER(Lokšņmateriāli!G56),Lokšņmateriāli!G56,\"\")","v":""},{"$f":"IF(ISNUMBER(Lokšņmateriāli!G56),Lokšņmateriāli!H56,\"\")","v":""},{"$f":"IF(ISTEXT(Lokšņmateriāli!I56),Lokšņmateriāli!I56,\"\")","v":""},""]
[{"$f":"IF(ISNUMBER(Lokšņmateriāli!G57),Lokšņmateriāli!A57,\"\")","v":""},{"$f":"IF(ISNUMBER(Lokšņmateriāli!G57),Lokšņmateriāli!B57,\"\")","v":""},{"$f":"IF(ISNUMBER(Lokšņmateriāli!G57),Lokšņmateriāli!C57,\"\")","v":""},{"$f":"IF(ISNUMBER(Lokšņmateriāli!G57),Lokšņmateriāli!E57,\"\")","v":""},{"$f":"IF(ISNUMBER(Lokšņmateriāli!G57),Lokšņmateriāli!G57,\"\")","v":""},{"$f":"IF(ISNUMBER(Lokšņmateriāli!G57),Lokšņmateriāli!H57,\"\")","v":""},{"$f":"IF(ISTEXT(Lokšņmateriāli!I57),Lokšņmateriāli!I57,\"\")","v":""},""]
[{"$f":"IF(ISNUMBER(Lokšņmateriāli!G58),Lokšņmateriāli!A58,\"\")","v":""},{"$f":"IF(ISNUMBER(Lokšņmateriāli!G58),Lokšņmateriāli!B58,\"\")","v":""},{"$f":"IF(ISNUMBER(Lokšņmateriāli!G58),Lokšņmateriāli!C58,\"\")","v":""},{"$f":"IF(ISNUMBER(Lokšņmateriāli!G58),Lokšņmateriāli!E58,\"\")","v":""},{"$f":"IF(ISNUMBER(Lokšņmateriāli!G58),Lokšņmateriāli!G58,\"\")","v":""},{"$f":"IF(ISNUMBER(Lokšņmateriāli!G58),Lokšņmateriāli!H58,\"\")","v":""},{"$f":"IF(ISTEXT(Lokšņmateriāli!I58),Lokšņmateriāli!I58,\"\")","v":""},""]
[{"$f":"IF(ISNUMBER(Lokšņmateriāli!G59),Lokšņmateriāli!A59,\"\")","v":""},{"$f":"IF(ISNUMBER(Lokšņmateriāli!G59),Lokšņmateriāli!B59,\"\")","v":""},{"$f":"IF(ISNUMBER(Lokšņmateriāli!G59),Lokšņmateriāli!C59,\"\")","v":""},{"$f":"IF(ISNUMBER(Lokšņmateriāli!G59),Lokšņmateriāli!E59,\"\")","v":""},{"$f":"IF(ISNUMBER(Lokšņmateriāli!G59),Lokšņmateriāli!G59,\"\")","v":""},{"$f":"IF(ISNUMBER(Lokšņmateriāli!G59),Lokšņmateriāli!H59,\"\")","v":""},{"$f":"IF(ISTEXT(Lokšņmateriāli!I59),Lokšņmateriāli!I59,\"\")","v":""},""]
[{"$f":"IF(ISNUMBER(Lokšņmateriāli!G60),Lokšņmateriāli!A60,\"\")","v":""},{"$f":"IF(ISNUMBER(Lokšņmateriāli!G60),Lokšņmateriāli!B60,\"\")","v":""},{"$f":"IF(ISNUMBER(Lokšņmateriāli!G60),Lokšņmateriāli!C60,\"\")","v":""},{"$f":"IF(ISNUMBER(Lokšņmateriāli!G60),Lokšņmateriāli!E60,\"\")","v":""},{"$f":"IF(ISNUMBER(Lokšņmateriāli!G60),Lokšņmateriāli!G60,\"\")","v":""},{"$f":"IF(ISNUMBER(Lokšņmateriāli!G60),Lokšņmateriāli!H60,\"\")","v":""},{"$f":"IF(ISTEXT(Lokšņmateriāli!I60),Lokšņmateriāli!I60,\"\")","v":""},""]
[{"$f":"IF(ISNUMBER(Lokšņmateriāli!G61),Lokšņmateriāli!A61,\"\")","v":""},{"$f":"IF(ISNUMBER(Lokšņmateriāli!G61),Lokšņmateriāli!B61,\"\")","v":""},{"$f":"IF(ISNUMBER(Lokšņmateriāli!G61),Lokšņmateriāli!C61,\"\")","v":""},{"$f":"IF(ISNUMBER(Lokšņmateriāli!G61),Lokšņmateriāli!E61,\"\")","v":""},{"$f":"IF(ISNUMBER(Lokšņmateriāli!G61),Lokšņmateriāli!G61,\"\")","v":""},{"$f":"IF(ISNUMBER(Lokšņmateriāli!G61),Lokšņmateriāli!H61,\"\")","v":""},{"$f":"IF(ISTEXT(Lokšņmateriāli!I61),Lokšņmateriāli!I61,\"\")","v":""},""]
[{"$f":"IF(ISNUMBER(Lokšņmateriāli!G62),Lokšņmateriāli!A62,\"\")","v":""},{"$f":"IF(ISNUMBER(Lokšņmateriāli!G62),Lokšņmateriāli!B62,\"\")","v":""},{"$f":"IF(ISNUMBER(Lokšņmateriāli!G62),Lokšņmateriāli!C62,\"\")","v":""},{"$f":"IF(ISNUMBER(Lokšņmateriāli!G62),Lokšņmateriāli!E62,\"\")","v":""},{"$f":"IF(ISNUMBER(Lokšņmateriāli!G62),Lokšņmateriāli!G62,\"\")","v":""},{"$f":"IF(ISNUMBER(Lokšņmateriāli!G62),Lokšņmateriāli!H62,\"\")","v":""},{"$f":"IF(ISTEXT(Lokšņmateriāli!I62),Lokšņmateriāli!I62,\"\")","v":""},""]
[{"$f":"IF(ISNUMBER(Lokšņmateriāli!G63),Lokšņmateriāli!A63,\"\")","v":""},{"$f":"IF(ISNUMBER(Lokšņmateriāli!G63),Lokšņmateriāli!B63,\"\")","v":""},{"$f":"IF(ISNUMBER(Lokšņmateriāli!G63),Lokšņmateriāli!C63,\"\")","v":""},{"$f":"IF(ISNUMBER(Lokšņmateriāli!G63),Lokšņmateriāli!E63,\"\")","v":""},{"$f":"IF(ISNUMBER(Lokšņmateriāli!G63),Lokšņmateriāli!G63,\"\")","v":""},{"$f":"IF(ISNUMBER(Lokšņmateriāli!G63),Lokšņmateriāli!H63,\"\")","v":""},{"$f":"IF(ISTEXT(Lokšņmateriāli!I63),Lokšņmateriāli!I63,\"\")","v":""},""]
[{"$f":"IF(ISNUMBER(Lokšņmateriāli!G64),Lokšņmateriāli!A64,\"\")","v":""},{"$f":"IF(ISNUMBER(Lokšņmateriāli!G64),Lokšņmateriāli!B64,\"\")","v":""},{"$f":"IF(ISNUMBER(Lokšņmateriāli!G64),Lokšņmateriāli!C64,\"\")","v":""},{"$f":"IF(ISNUMBER(Lokšņmateriāli!G64),Lokšņmateriāli!E64,\"\")","v":""},{"$f":"IF(ISNUMBER(Lokšņmateriāli!G64),Lokšņmateriāli!G64,\"\")","v":""},{"$f":"IF(ISNUMBER(Lokšņmateriāli!G64),Lokšņmateriāli!H64,\"\")","v":""},{"$f":"IF(ISTEXT(Lokšņmateriāli!I64),Lokšņmateriāli!I64,\"\")","v":""},""]
[{"$f":"IF(ISNUMBER(Lokšņmateriāli!G65),Lokšņmateriāli!A65,\"\")","v":""},{"$f":"IF(ISNUMBER(Lokšņmateriāli!G65),Lokšņmateriāli!B65,\"\")","v":""},{"$f":"IF(ISNUMBER(Lokšņmateriāli!G65),Lokšņmateriāli!C65,\"\")","v":""},{"$f":"IF(ISNUMBER(Lokšņmateriāli!G65),Lokšņmateriāli!E65,\"\")","v":""},{"$f":"IF(ISNUMBER(Lokšņmateriāli!G65),Lokšņmateriāli!G65,\"\")","v":""},{"$f":"IF(ISNUMBER(Lokšņmateriāli!G65),Lokšņmateriāli!H65,\"\")","v":""},{"$f":"IF(ISTEXT(Lokšņmateriāli!I65),Lokšņmateriāli!I65,\"\")","v":""},""]
[{"$f":"IF(ISNUMBER(Lokšņmateriāli!G66),Lokšņmateriāli!A66,\"\")","v":""},{"$f":"IF(ISNUMBER(Lokšņmateriāli!G66),Lokšņmateriāli!B66,\"\")","v":""},{"$f":"IF(ISNUMBER(Lokšņmateriāli!G66),Lokšņmateriāli!C66,\"\")","v":""},{"$f":"IF(ISNUMBER(Lokšņmateriāli!G66),Lokšņmateriāli!E66,\"\")","v":""},{"$f":"IF(ISNUMBER(Lokšņmateriāli!G66),Lokšņmateriāli!G66,\"\")","v":""},{"$f":"IF(ISNUMBER(Lokšņmateriāli!G66),Lokšņmateriāli!H66,\"\")","v":""},{"$f":"IF(ISTEXT(Lokšņmateriāli!I66),Lokšņmateriāli!I66,\"\")","v":""},""]
[]
[]
[{"$f":"IF(ISNUMBER(Siltumizolācija!G4),Siltumizolācija!A4,\"\")","v":""},{"$f":"IF(ISNUMBER(Siltumizolācija!G4),Siltumizolācija!B4,\"\")","v":""},{"$f":"IF(ISNUMBER(Siltumizolācija!G4),Siltumizolācija!C4,\"\")","v":""},{"$f":"IF(ISNUMBER(Siltumizolācija!G4),Siltumizolācija!E4,\"\")","v":""},{"$f":"IF(ISNUMBER(Siltumizolācija!G4),Siltumizolācija!G4,\"\")","v":""},{"$f":"IF(ISNUMBER(Siltumizolācija!G4),Siltumizolācija!H4,\"\")","v":""},{"$f":"IF(ISTEXT(Siltumizolācija!I4),Siltumizolācija!I4,\"\")","v":""},{"$f":"IF(ISNUMBER(E288),\"yes\",\"\")","v":""}]
[{"$f":"IF(ISNUMBER(Siltumizolācija!G5),Siltumizolācija!A5,\"\")","v":""},{"$f":"IF(ISNUMBER(Siltumizolācija!G5),Siltumizolācija!B5,\"\")","v":""},{"$f":"IF(ISNUMBER(Siltumizolācija!G5),Siltumizolācija!C5,\"\")","v":""},{"$f":"IF(ISNUMBER(Siltumizolācija!G5),Siltumizolācija!E5,\"\")","v":""},{"$f":"IF(ISNUMBER(Siltumizolācija!G5),Siltumizolācija!G5,\"\")","v":""},{"$f":"IF(ISNUMBER(Siltumizolācija!G5),Siltumizolācija!H5,\"\")","v":""},{"$f":"IF(ISTEXT(Siltumizolācija!I5),Siltumizolācija!I5,\"\")","v":""},""]
[{"$f":"IF(ISNUMBER(Siltumizolācija!G6),Siltumizolācija!A6,\"\")","v":""},{"$f":"IF(ISNUMBER(Siltumizolācija!G6),Siltumizolācija!B6,\"\")","v":""},{"$f":"IF(ISNUMBER(Siltumizolācija!G6),Siltumizolācija!C6,\"\")","v":""},{"$f":"IF(ISNUMBER(Siltumizolācija!G6),Siltumizolācija!E6,\"\")","v":""},{"$f":"IF(ISNUMBER(Siltumizolācija!G6),Siltumizolācija!G6,\"\")","v":""},{"$f":"IF(ISNUMBER(Siltumizolācija!G6),Siltumizolācija!H6,\"\")","v":""},{"$f":"IF(ISTEXT(Siltumizolācija!I6),Siltumizolācija!I6,\"\")","v":""},""]
[{"$f":"IF(ISNUMBER(Siltumizolācija!G7),Siltumizolācija!A7,\"\")","v":""},{"$f":"IF(ISNUMBER(Siltumizolācija!G7),Siltumizolācija!B7,\"\")","v":""},{"$f":"IF(ISNUMBER(Siltumizolācija!G7),Siltumizolācija!C7,\"\")","v":""},{"$f":"IF(ISNUMBER(Siltumizolācija!G7),Siltumizolācija!E7,\"\")","v":""},{"$f":"IF(ISNUMBER(Siltumizolācija!G7),Siltumizolācija!G7,\"\")","v":""},{"$f":"IF(ISNUMBER(Siltumizolācija!G7),Siltumizolācija!H7,\"\")","v":""},{"$f":"IF(ISTEXT(Siltumizolācija!I7),Siltumizolācija!I7,\"\")","v":""},""]
[{"$f":"IF(ISNUMBER(Siltumizolācija!G8),Siltumizolācija!A8,\"\")","v":""},{"$f":"IF(ISNUMBER(Siltumizolācija!G8),Siltumizolācija!B8,\"\")","v":""},{"$f":"IF(ISNUMBER(Siltumizolācija!G8),Siltumizolācija!C8,\"\")","v":""},{"$f":"IF(ISNUMBER(Siltumizolācija!G8),Siltumizolācija!E8,\"\")","v":""},{"$f":"IF(ISNUMBER(Siltumizolācija!G8),Siltumizolācija!G8,\"\")","v":""},{"$f":"IF(ISNUMBER(Siltumizolācija!G8),Siltumizolācija!H8,\"\")","v":""},{"$f":"IF(ISTEXT(Siltumizolācija!I8),Siltumizolācija!I8,\"\")","v":""},""]
[{"$f":"IF(ISNUMBER(Siltumizolācija!G9),Siltumizolācija!A9,\"\")","v":""},{"$f":"IF(ISNUMBER(Siltumizolācija!G9),Siltumizolācija!B9,\"\")","v":""},{"$f":"IF(ISNUMBER(Siltumizolācija!G9),Siltumizolācija!C9,\"\")","v":""},{"$f":"IF(ISNUMBER(Siltumizolācija!G9),Siltumizolācija!E9,\"\")","v":""},{"$f":"IF(ISNUMBER(Siltumizolācija!G9),Siltumizolācija!G9,\"\")","v":""},{"$f":"IF(ISNUMBER(Siltumizolācija!G9),Siltumizolācija!H9,\"\")","v":""},{"$f":"IF(ISTEXT(Siltumizolācija!I9),Siltumizolācija!I9,\"\")","v":""},""]
[{"$f":"IF(ISNUMBER(Siltumizolācija!G10),Siltumizolācija!A10,\"\")","v":""},{"$f":"IF(ISNUMBER(Siltumizolācija!G10),Siltumizolācija!B10,\"\")","v":""},{"$f":"IF(ISNUMBER(Siltumizolācija!G10),Siltumizolācija!C10,\"\")","v":""},{"$f":"IF(ISNUMBER(Siltumizolācija!G10),Siltumizolācija!E10,\"\")","v":""},{"$f":"IF(ISNUMBER(Siltumizolācija!G10),Siltumizolācija!G10,\"\")","v":""},{"$f":"IF(ISNUMBER(Siltumizolācija!G10),Siltumizolācija!H10,\"\")","v":""},{"$f":"IF(ISTEXT(Siltumizolācija!I10),Siltumizolācija!I10,\"\")","v":""},""]
[{"$f":"IF(ISNUMBER(Siltumizolācija!G11),Siltumizolācija!A11,\"\")","v":""},{"$f":"IF(ISNUMBER(Siltumizolācija!G11),Siltumizolācija!B11,\"\")","v":""},{"$f":"IF(ISNUMBER(Siltumizolācija!G11),Siltumizolācija!C11,\"\")","v":""},{"$f":"IF(ISNUMBER(Siltumizolācija!G11),Siltumizolācija!E11,\"\")","v":""},{"$f":"IF(ISNUMBER(Siltumizolācija!G11),Siltumizolācija!G11,\"\")","v":""},{"$f":"IF(ISNUMBER(Siltumizolācija!G11),Siltumizolācija!H11,\"\")","v":""},{"$f":"IF(ISTEXT(Siltumizolācija!I11),Siltumizolācija!I11,\"\")","v":""},""]
[{"$f":"IF(ISNUMBER(Siltumizolācija!G12),Siltumizolācija!A12,\"\")","v":""},{"$f":"IF(ISNUMBER(Siltumizolācija!G12),Siltumizolācija!B12,\"\")","v":""},{"$f":"IF(ISNUMBER(Siltumizolācija!G12),Siltumizolācija!C12,\"\")","v":""},{"$f":"IF(ISNUMBER(Siltumizolācija!G12),Siltumizolācija!E12,\"\")","v":""},{"$f":"IF(ISNUMBER(Siltumizolācija!G12),Siltumizolācija!G12,\"\")","v":""},{"$f":"IF(ISNUMBER(Siltumizolācija!G12),Siltumizolācija!H12,\"\")","v":""},{"$f":"IF(ISTEXT(Siltumizolācija!I12),Siltumizolācija!I12,\"\")","v":""},""]
[{"$f":"IF(ISNUMBER(Siltumizolācija!G13),Siltumizolācija!A13,\"\")","v":""},{"$f":"IF(ISNUMBER(Siltumizolācija!G13),Siltumizolācija!B13,\"\")","v":""},{"$f":"IF(ISNUMBER(Siltumizolācija!G13),Siltumizolācija!C13,\"\")","v":""},{"$f":"IF(ISNUMBER(Siltumizolācija!G13),Siltumizolācija!E13,\"\")","v":""},{"$f":"IF(ISNUMBER(Siltumizolācija!G13),Siltumizolācija!G13,\"\")","v":""},{"$f":"IF(ISNUMBER(Siltumizolācija!G13),Siltumizolācija!H13,\"\")","v":""},{"$f":"IF(ISTEXT(Siltumizolācija!I13),Siltumizolācija!I13,\"\")","v":""},""]
[{"$f":"IF(ISNUMBER(Siltumizolācija!G14),Siltumizolācija!A14,\"\")","v":""},{"$f":"IF(ISNUMBER(Siltumizolācija!G14),Siltumizolācija!B14,\"\")","v":""},{"$f":"IF(ISNUMBER(Siltumizolācija!G14),Siltumizolācija!C14,\"\")","v":""},{"$f":"IF(ISNUMBER(Siltumizolācija!G14),Siltumizolācija!E14,\"\")","v":""},{"$f":"IF(ISNUMBER(Siltumizolācija!G14),Siltumizolācija!G14,\"\")","v":""},{"$f":"IF(ISNUMBER(Siltumizolācija!G14),Siltumizolācija!H14,\"\")","v":""},{"$f":"IF(ISTEXT(Siltumizolācija!I14),Siltumizolācija!I14,\"\")","v":""},""]
[{"$f":"IF(ISNUMBER(Siltumizolācija!G15),Siltumizolācija!A15,\"\")","v":""},{"$f":"IF(ISNUMBER(Siltumizolācija!G15),Siltumizolācija!B15,\"\")","v":""},{"$f":"IF(ISNUMBER(Siltumizolācija!G15),Siltumizolācija!C15,\"\")","v":""},{"$f":"IF(ISNUMBER(Siltumizolācija!G15),Siltumizolācija!E15,\"\")","v":""},{"$f":"IF(ISNUMBER(Siltumizolācija!G15),Siltumizolācija!G15,\"\")","v":""},{"$f":"IF(ISNUMBER(Siltumizolācija!G15),Siltumizolācija!H15,\"\")","v":""},{"$f":"IF(ISTEXT(Siltumizolācija!I15),Siltumizolācija!I15,\"\")","v":""},""]
[{"$f":"IF(ISNUMBER(Siltumizolācija!G16),Siltumizolācija!A16,\"\")","v":""},{"$f":"IF(ISNUMBER(Siltumizolācija!G16),Siltumizolācija!B16,\"\")","v":""},{"$f":"IF(ISNUMBER(Siltumizolācija!G16),Siltumizolācija!C16,\"\")","v":""},{"$f":"IF(ISNUMBER(Siltumizolācija!G16),Siltumizolācija!E16,\"\")","v":""},{"$f":"IF(ISNUMBER(Siltumizolācija!G16),Siltumizolācija!G16,\"\")","v":""},{"$f":"IF(ISNUMBER(Siltumizolācija!G16),Siltumizolācija!H16,\"\")","v":""},{"$f":"IF(ISTEXT(Siltumizolācija!I16),Siltumizolācija!I16,\"\")","v":""},""]
[{"$f":"IF(ISNUMBER(Siltumizolācija!G17),Siltumizolācija!A17,\"\")","v":""},{"$f":"IF(ISNUMBER(Siltumizolācija!G17),Siltumizolācija!B17,\"\")","v":""},{"$f":"IF(ISNUMBER(Siltumizolācija!G17),Siltumizolācija!C17,\"\")","v":""},{"$f":"IF(ISNUMBER(Siltumizolācija!G17),Siltumizolācija!E17,\"\")","v":""},{"$f":"IF(ISNUMBER(Siltumizolācija!G17),Siltumizolācija!G17,\"\")","v":""},{"$f":"IF(ISNUMBER(Siltumizolācija!G17),Siltumizolācija!H17,\"\")","v":""},{"$f":"IF(ISTEXT(Siltumizolācija!I17),Siltumizolācija!I17,\"\")","v":""},""]
[{"$f":"IF(ISNUMBER(Siltumizolācija!G18),Siltumizolācija!A18,\"\")","v":""},{"$f":"IF(ISNUMBER(Siltumizolācija!G18),Siltumizolācija!B18,\"\")","v":""},{"$f":"IF(ISNUMBER(Siltumizolācija!G18),Siltumizolācija!C18,\"\")","v":""},{"$f":"IF(ISNUMBER(Siltumizolācija!G18),Siltumizolācija!E18,\"\")","v":""},{"$f":"IF(ISNUMBER(Siltumizolācija!G18),Siltumizolācija!G18,\"\")","v":""},{"$f":"IF(ISNUMBER(Siltumizolācija!G18),Siltumizolācija!H18,\"\")","v":""},{"$f":"IF(ISTEXT(Siltumizolācija!I18),Siltumizolācija!I18,\"\")","v":""},""]
[{"$f":"IF(ISNUMBER(Siltumizolācija!G19),Siltumizolācija!A19,\"\")","v":""},{"$f":"IF(ISNUMBER(Siltumizolācija!G19),Siltumizolācija!B19,\"\")","v":""},{"$f":"IF(ISNUMBER(Siltumizolācija!G19),Siltumizolācija!C19,\"\")","v":""},{"$f":"IF(ISNUMBER(Siltumizolācija!G19),Siltumizolācija!E19,\"\")","v":""},{"$f":"IF(ISNUMBER(Siltumizolācija!G19),Siltumizolācija!G19,\"\")","v":""},{"$f":"IF(ISNUMBER(Siltumizolācija!G19),Siltumizolācija!H19,\"\")","v":""},{"$f":"IF(ISTEXT(Siltumizolācija!I19),Siltumizolācija!I19,\"\")","v":""},""]
[{"$f":"IF(ISNUMBER(Siltumizolācija!G20),Siltumizolācija!A20,\"\")","v":""},{"$f":"IF(ISNUMBER(Siltumizolācija!G20),Siltumizolācija!B20,\"\")","v":""},{"$f":"IF(ISNUMBER(Siltumizolācija!G20),Siltumizolācija!C20,\"\")","v":""},{"$f":"IF(ISNUMBER(Siltumizolācija!G20),Siltumizolācija!E20,\"\")","v":""},{"$f":"IF(ISNUMBER(Siltumizolācija!G20),Siltumizolācija!G20,\"\")","v":""},{"$f":"IF(ISNUMBER(Siltumizolācija!G20),Siltumizolācija!H20,\"\")","v":""},{"$f":"IF(ISTEXT(Siltumizolācija!I20),Siltumizolācija!I20,\"\")","v":""},""]
[{"$f":"IF(ISNUMBER(Siltumizolācija!G21),Siltumizolācija!A21,\"\")","v":""},{"$f":"IF(ISNUMBER(Siltumizolācija!G21),Siltumizolācija!B21,\"\")","v":""},{"$f":"IF(ISNUMBER(Siltumizolācija!G21),Siltumizolācija!C21,\"\")","v":""},{"$f":"IF(ISNUMBER(Siltumizolācija!G21),Siltumizolācija!E21,\"\")","v":""},{"$f":"IF(ISNUMBER(Siltumizolācija!G21),Siltumizolācija!G21,\"\")","v":""},{"$f":"IF(ISNUMBER(Siltumizolācija!G21),Siltumizolācija!H21,\"\")","v":""},{"$f":"IF(ISTEXT(Siltumizolācija!I21),Siltumizolācija!I21,\"\")","v":""},""]
[{"$f":"IF(ISNUMBER(Siltumizolācija!G22),Siltumizolācija!A22,\"\")","v":""},{"$f":"IF(ISNUMBER(Siltumizolācija!G22),Siltumizolācija!B22,\"\")","v":""},{"$f":"IF(ISNUMBER(Siltumizolācija!G22),Siltumizolācija!C22,\"\")","v":""},{"$f":"IF(ISNUMBER(Siltumizolācija!G22),Siltumizolācija!E22,\"\")","v":""},{"$f":"IF(ISNUMBER(Siltumizolācija!G22),Siltumizolācija!G22,\"\")","v":""},{"$f":"IF(ISNUMBER(Siltumizolācija!G22),Siltumizolācija!H22,\"\")","v":""},{"$f":"IF(ISTEXT(Siltumizolācija!I22),Siltumizolācija!I22,\"\")","v":""},""]
[{"$f":"IF(ISNUMBER(Siltumizolācija!G23),Siltumizolācija!A23,\"\")","v":""},{"$f":"IF(ISNUMBER(Siltumizolācija!G23),Siltumizolācija!B23,\"\")","v":""},{"$f":"IF(ISNUMBER(Siltumizolācija!G23),Siltumizolācija!C23,\"\")","v":""},{"$f":"IF(ISNUMBER(Siltumizolācija!G23),Siltumizolācija!E23,\"\")","v":""},{"$f":"IF(ISNUMBER(Siltumizolācija!G23),Siltumizolācija!G23,\"\")","v":""},{"$f":"IF(ISNUMBER(Siltumizolācija!G23),Siltumizolācija!H23,\"\")","v":""},{"$f":"IF(ISTEXT(Siltumizolācija!I23),Siltumizolācija!I23,\"\")","v":""},""]
[{"$f":"IF(ISNUMBER(Siltumizolācija!G24),Siltumizolācija!A24,\"\")","v":""},{"$f":"IF(ISNUMBER(Siltumizolācija!G24),Siltumizolācija!B24,\"\")","v":""},{"$f":"IF(ISNUMBER(Siltumizolācija!G24),Siltumizolācija!C24,\"\")","v":""},{"$f":"IF(ISNUMBER(Siltumizolācija!G24),Siltumizolācija!E24,\"\")","v":""},{"$f":"IF(ISNUMBER(Siltumizolācija!G24),Siltumizolācija!G24,\"\")","v":""},{"$f":"IF(ISNUMBER(Siltumizolācija!G24),Siltumizolācija!H24,\"\")","v":""},{"$f":"IF(ISTEXT(Siltumizolācija!I24),Siltumizolācija!I24,\"\")","v":""},""]
[{"$f":"IF(ISNUMBER(Siltumizolācija!G25),Siltumizolācija!A25,\"\")","v":""},{"$f":"IF(ISNUMBER(Siltumizolācija!G25),Siltumizolācija!B25,\"\")","v":""},{"$f":"IF(ISNUMBER(Siltumizolācija!G25),Siltumizolācija!C25,\"\")","v":""},{"$f":"IF(ISNUMBER(Siltumizolācija!G25),Siltumizolācija!E25,\"\")","v":""},{"$f":"IF(ISNUMBER(Siltumizolācija!G25),Siltumizolācija!G25,\"\")","v":""},{"$f":"IF(ISNUMBER(Siltumizolācija!G25),Siltumizolācija!H25,\"\")","v":""},{"$f":"IF(ISTEXT(Siltumizolācija!I25),Siltumizolācija!I25,\"\")","v":""},""]
[{"$f":"IF(ISNUMBER(Siltumizolācija!G26),Siltumizolācija!A26,\"\")","v":""},{"$f":"IF(ISNUMBER(Siltumizolācija!G26),Siltumizolācija!B26,\"\")","v":""},{"$f":"IF(ISNUMBER(Siltumizolācija!G26),Siltumizolācija!C26,\"\")","v":""},{"$f":"IF(ISNUMBER(Siltumizolācija!G26),Siltumizolācija!E26,\"\")","v":""},{"$f":"IF(ISNUMBER(Siltumizolācija!G26),Siltumizolācija!G26,\"\")","v":""},{"$f":"IF(ISNUMBER(Siltumizolācija!G26),Siltumizolācija!H26,\"\")","v":""},{"$f":"IF(ISTEXT(Siltumizolācija!I26),Siltumizolācija!I26,\"\")","v":""},""]
[{"$f":"IF(ISNUMBER(Siltumizolācija!G27),Siltumizolācija!A27,\"\")","v":""},{"$f":"IF(ISNUMBER(Siltumizolācija!G27),Siltumizolācija!B27,\"\")","v":""},{"$f":"IF(ISNUMBER(Siltumizolācija!G27),Siltumizolācija!C27,\"\")","v":""},{"$f":"IF(ISNUMBER(Siltumizolācija!G27),Siltumizolācija!E27,\"\")","v":""},{"$f":"IF(ISNUMBER(Siltumizolācija!G27),Siltumizolācija!G27,\"\")","v":""},{"$f":"IF(ISNUMBER(Siltumizolācija!G27),Siltumizolācija!H27,\"\")","v":""},{"$f":"IF(ISTEXT(Siltumizolācija!I27),Siltumizolācija!I27,\"\")","v":""},""]
[{"$f":"IF(ISNUMBER(Siltumizolācija!G28),Siltumizolācija!A28,\"\")","v":""},{"$f":"IF(ISNUMBER(Siltumizolācija!G28),Siltumizolācija!B28,\"\")","v":""},{"$f":"IF(ISNUMBER(Siltumizolācija!G28),Siltumizolācija!C28,\"\")","v":""},{"$f":"IF(ISNUMBER(Siltumizolācija!G28),Siltumizolācija!E28,\"\")","v":""},{"$f":"IF(ISNUMBER(Siltumizolācija!G28),Siltumizolācija!G28,\"\")","v":""},{"$f":"IF(ISNUMBER(Siltumizolācija!G28),Siltumizolācija!H28,\"\")","v":""},{"$f":"IF(ISTEXT(Siltumizolācija!I28),Siltumizolācija!I28,\"\")","v":""},""]
[{"$f":"IF(ISNUMBER(Siltumizolācija!G29),Siltumizolācija!A29,\"\")","v":""},{"$f":"IF(ISNUMBER(Siltumizolācija!G29),Siltumizolācija!B29,\"\")","v":""},{"$f":"IF(ISNUMBER(Siltumizolācija!G29),Siltumizolācija!C29,\"\")","v":""},{"$f":"IF(ISNUMBER(Siltumizolācija!G29),Siltumizolācija!E29,\"\")","v":""},{"$f":"IF(ISNUMBER(Siltumizolācija!G29),Siltumizolācija!G29,\"\")","v":""},{"$f":"IF(ISNUMBER(Siltumizolācija!G29),Siltumizolācija!H29,\"\")","v":""},{"$f":"IF(ISTEXT(Siltumizolācija!I29),Siltumizolācija!I29,\"\")","v":""},""]
[{"$f":"IF(ISNUMBER(Siltumizolācija!G30),Siltumizolācija!A30,\"\")","v":""},{"$f":"IF(ISNUMBER(Siltumizolācija!G30),Siltumizolācija!B30,\"\")","v":""},{"$f":"IF(ISNUMBER(Siltumizolācija!G30),Siltumizolācija!C30,\"\")","v":""},{"$f":"IF(ISNUMBER(Siltumizolācija!G30),Siltumizolācija!E30,\"\")","v":""},{"$f":"IF(ISNUMBER(Siltumizolācija!G30),Siltumizolācija!G30,\"\")","v":""},{"$f":"IF(ISNUMBER(Siltumizolācija!G30),Siltumizolācija!H30,\"\")","v":""},{"$f":"IF(ISTEXT(Siltumizolācija!I30),Siltumizolācija!I30,\"\")","v":""},""]
[{"$f":"IF(ISNUMBER(Siltumizolācija!G31),Siltumizolācija!A31,\"\")","v":""},{"$f":"IF(ISNUMBER(Siltumizolācija!G31),Siltumizolācija!B31,\"\")","v":""},{"$f":"IF(ISNUMBER(Siltumizolācija!G31),Siltumizolācija!C31,\"\")","v":""},{"$f":"IF(ISNUMBER(Siltumizolācija!G31),Siltumizolācija!E31,\"\")","v":""},{"$f":"IF(ISNUMBER(Siltumizolācija!G31),Siltumizolācija!G31,\"\")","v":""},{"$f":"IF(ISNUMBER(Siltumizolācija!G31),Siltumizolācija!H31,\"\")","v":""},{"$f":"IF(ISTEXT(Siltumizolācija!I31),Siltumizolācija!I31,\"\")","v":""},""]
[{"$f":"IF(ISNUMBER(Siltumizolācija!G32),Siltumizolācija!A32,\"\")","v":""},{"$f":"IF(ISNUMBER(Siltumizolācija!G32),Siltumizolācija!B32,\"\")","v":""},{"$f":"IF(ISNUMBER(Siltumizolācija!G32),Siltumizolācija!C32,\"\")","v":""},{"$f":"IF(ISNUMBER(Siltumizolācija!G32),Siltumizolācija!E32,\"\")","v":""},{"$f":"IF(ISNUMBER(Siltumizolācija!G32),Siltumizolācija!G32,\"\")","v":""},{"$f":"IF(ISNUMBER(Siltumizolācija!G32),Siltumizolācija!H32,\"\")","v":""},{"$f":"IF(ISTEXT(Siltumizolācija!I32),Siltumizolācija!I32,\"\")","v":""},""]
[{"$f":"IF(ISNUMBER(Siltumizolācija!G33),Siltumizolācija!A33,\"\")","v":""},{"$f":"IF(ISNUMBER(Siltumizolācija!G33),Siltumizolācija!B33,\"\")","v":""},{"$f":"IF(ISNUMBER(Siltumizolācija!G33),Siltumizolācija!C33,\"\")","v":""},{"$f":"IF(ISNUMBER(Siltumizolācija!G33),Siltumizolācija!E33,\"\")","v":""},{"$f":"IF(ISNUMBER(Siltumizolācija!G33),Siltumizolācija!G33,\"\")","v":""},{"$f":"IF(ISNUMBER(Siltumizolācija!G33),Siltumizolācija!H33,\"\")","v":""},{"$f":"IF(ISTEXT(Siltumizolācija!I33),Siltumizolācija!I33,\"\")","v":""},""]
[{"$f":"IF(ISNUMBER(Siltumizolācija!G34),Siltumizolācija!A34,\"\")","v":""},{"$f":"IF(ISNUMBER(Siltumizolācija!G34),Siltumizolācija!B34,\"\")","v":""},{"$f":"IF(ISNUMBER(Siltumizolācija!G34),Siltumizolācija!C34,\"\")","v":""},{"$f":"IF(ISNUMBER(Siltumizolācija!G34),Siltumizolācija!E34,\"\")","v":""},{"$f":"IF(ISNUMBER(Siltumizolācija!G34),Siltumizolācija!G34,\"\")","v":""},{"$f":"IF(ISNUMBER(Siltumizolācija!G34),Siltumizolācija!H34,\"\")","v":""},{"$f":"IF(ISTEXT(Siltumizolācija!I34),Siltumizolācija!I34,\"\")","v":""},""]
[{"$f":"IF(ISNUMBER(Siltumizolācija!G35),Siltumizolācija!A35,\"\")","v":""},{"$f":"IF(ISNUMBER(Siltumizolācija!G35),Siltumizolācija!B35,\"\")","v":""},{"$f":"IF(ISNUMBER(Siltumizolācija!G35),Siltumizolācija!C35,\"\")","v":""},{"$f":"IF(ISNUMBER(Siltumizolācija!G35),Siltumizolācija!E35,\"\")","v":""},{"$f":"IF(ISNUMBER(Siltumizolācija!G35),Siltumizolācija!G35,\"\")","v":""},{"$f":"IF(ISNUMBER(Siltumizolācija!G35),Siltumizolācija!H35,\"\")","v":""},{"$f":"IF(ISTEXT(Siltumizolācija!I35),Siltumizolācija!I35,\"\")","v":""},""]
[{"$f":"IF(ISNUMBER(Siltumizolācija!G36),Siltumizolācija!A36,\"\")","v":""},{"$f":"IF(ISNUMBER(Siltumizolācija!G36),Siltumizolācija!B36,\"\")","v":""},{"$f":"IF(ISNUMBER(Siltumizolācija!G36),Siltumizolācija!C36,\"\")","v":""},{"$f":"IF(ISNUMBER(Siltumizolācija!G36),Siltumizolācija!E36,\"\")","v":""},{"$f":"IF(ISNUMBER(Siltumizolācija!G36),Siltumizolācija!G36,\"\")","v":""},{"$f":"IF(ISNUMBER(Siltumizolācija!G36),Siltumizolācija!H36,\"\")","v":""},{"$f":"IF(ISTEXT(Siltumizolācija!I36),Siltumizolācija!I36,\"\")","v":""},""]
[{"$f":"IF(ISNUMBER(Siltumizolācija!G37),Siltumizolācija!A37,\"\")","v":""},{"$f":"IF(ISNUMBER(Siltumizolācija!G37),Siltumizolācija!B37,\"\")","v":""},{"$f":"IF(ISNUMBER(Siltumizolācija!G37),Siltumizolācija!C37,\"\")","v":""},{"$f":"IF(ISNUMBER(Siltumizolācija!G37),Siltumizolācija!E37,\"\")","v":""},{"$f":"IF(ISNUMBER(Siltumizolācija!G37),Siltumizolācija!G37,\"\")","v":""},{"$f":"IF(ISNUMBER(Siltumizolācija!G37),Siltumizolācija!H37,\"\")","v":""},{"$f":"IF(ISTEXT(Siltumizolācija!I37),Siltumizolācija!I37,\"\")","v":""},""]
[{"$f":"IF(ISNUMBER(Siltumizolācija!G38),Siltumizolācija!A38,\"\")","v":""},{"$f":"IF(ISNUMBER(Siltumizolācija!G38),Siltumizolācija!B38,\"\")","v":""},{"$f":"IF(ISNUMBER(Siltumizolācija!G38),Siltumizolācija!C38,\"\")","v":""},{"$f":"IF(ISNUMBER(Siltumizolācija!G38),Siltumizolācija!E38,\"\")","v":""},{"$f":"IF(ISNUMBER(Siltumizolācija!G38),Siltumizolācija!G38,\"\")","v":""},{"$f":"IF(ISNUMBER(Siltumizolācija!G38),Siltumizolācija!H38,\"\")","v":""},{"$f":"IF(ISTEXT(Siltumizolācija!I38),Siltumizolācija!I38,\"\")","v":""},""]
[{"$f":"IF(ISNUMBER(Siltumizolācija!G39),Siltumizolācija!A39,\"\")","v":""},{"$f":"IF(ISNUMBER(Siltumizolācija!G39),Siltumizolācija!B39,\"\")","v":""},{"$f":"IF(ISNUMBER(Siltumizolācija!G39),Siltumizolācija!C39,\"\")","v":""},{"$f":"IF(ISNUMBER(Siltumizolācija!G39),Siltumizolācija!E39,\"\")","v":""},{"$f":"IF(ISNUMBER(Siltumizolācija!G39),Siltumizolācija!G39,\"\")","v":""},{"$f":"IF(ISNUMBER(Siltumizolācija!G39),Siltumizolācija!H39,\"\")","v":""},{"$f":"IF(ISTEXT(Siltumizolācija!I39),Siltumizolācija!I39,\"\")","v":""},""]
[{"$f":"IF(ISNUMBER(Siltumizolācija!G40),Siltumizolācija!A40,\"\")","v":""},{"$f":"IF(ISNUMBER(Siltumizolācija!G40),Siltumizolācija!B40,\"\")","v":""},{"$f":"IF(ISNUMBER(Siltumizolācija!G40),Siltumizolācija!C40,\"\")","v":""},{"$f":"IF(ISNUMBER(Siltumizolācija!G40),Siltumizolācija!E40,\"\")","v":""},{"$f":"IF(ISNUMBER(Siltumizolācija!G40),Siltumizolācija!G40,\"\")","v":""},{"$f":"IF(ISNUMBER(Siltumizolācija!G40),Siltumizolācija!H40,\"\")","v":""},{"$f":"IF(ISTEXT(Siltumizolācija!I40),Siltumizolācija!I40,\"\")","v":""},""]
[{"$f":"IF(ISNUMBER(Siltumizolācija!G41),Siltumizolācija!A41,\"\")","v":""},{"$f":"IF(ISNUMBER(Siltumizolācija!G41),Siltumizolācija!B41,\"\")","v":""},{"$f":"IF(ISNUMBER(Siltumizolācija!G41),Siltumizolācija!C41,\"\")","v":""},{"$f":"IF(ISNUMBER(Siltumizolācija!G41),Siltumizolācija!E41,\"\")","v":""},{"$f":"IF(ISNUMBER(Siltumizolācija!G41),Siltumizolācija!G41,\"\")","v":""},{"$f":"IF(ISNUMBER(Siltumizolācija!G41),Siltumizolācija!H41,\"\")","v":""},{"$f":"IF(ISTEXT(Siltumizolācija!I41),Siltumizolācija!I41,\"\")","v":""},""]
[{"$f":"IF(ISNUMBER(Siltumizolācija!G42),Siltumizolācija!A42,\"\")","v":""},{"$f":"IF(ISNUMBER(Siltumizolācija!G42),Siltumizolācija!B42,\"\")","v":""},{"$f":"IF(ISNUMBER(Siltumizolācija!G42),Siltumizolācija!C42,\"\")","v":""},{"$f":"IF(ISNUMBER(Siltumizolācija!G42),Siltumizolācija!E42,\"\")","v":""},{"$f":"IF(ISNUMBER(Siltumizolācija!G42),Siltumizolācija!G42,\"\")","v":""},{"$f":"IF(ISNUMBER(Siltumizolācija!G42),Siltumizolācija!H42,\"\")","v":""},{"$f":"IF(ISTEXT(Siltumizolācija!I42),Siltumizolācija!I42,\"\")","v":""},""]
[{"$f":"IF(ISNUMBER(Siltumizolācija!G43),Siltumizolācija!A43,\"\")","v":""},{"$f":"IF(ISNUMBER(Siltumizolācija!G43),Siltumizolācija!B43,\"\")","v":""},{"$f":"IF(ISNUMBER(Siltumizolācija!G43),Siltumizolācija!C43,\"\")","v":""},{"$f":"IF(ISNUMBER(Siltumizolācija!G43),Siltumizolācija!E43,\"\")","v":""},{"$f":"IF(ISNUMBER(Siltumizolācija!G43),Siltumizolācija!G43,\"\")","v":""},{"$f":"IF(ISNUMBER(Siltumizolācija!G43),Siltumizolācija!H43,\"\")","v":""},{"$f":"IF(ISTEXT(Siltumizolācija!I43),Siltumizolācija!I43,\"\")","v":""},""]
[{"$f":"IF(ISNUMBER(Siltumizolācija!G44),Siltumizolācija!A44,\"\")","v":""},{"$f":"IF(ISNUMBER(Siltumizolācija!G44),Siltumizolācija!B44,\"\")","v":""},{"$f":"IF(ISNUMBER(Siltumizolācija!G44),Siltumizolācija!C44,\"\")","v":""},{"$f":"IF(ISNUMBER(Siltumizolācija!G44),Siltumizolācija!E44,\"\")","v":""},{"$f":"IF(ISNUMBER(Siltumizolācija!G44),Siltumizolācija!G44,\"\")","v":""},{"$f":"IF(ISNUMBER(Siltumizolācija!G44),Siltumizolācija!H44,\"\")","v":""},{"$f":"IF(ISTEXT(Siltumizolācija!I44),Siltumizolācija!I44,\"\")","v":""},""]
[{"$f":"IF(ISNUMBER(Siltumizolācija!G45),Siltumizolācija!A45,\"\")","v":""},{"$f":"IF(ISNUMBER(Siltumizolācija!G45),Siltumizolācija!B45,\"\")","v":""},{"$f":"IF(ISNUMBER(Siltumizolācija!G45),Siltumizolācija!C45,\"\")","v":""},{"$f":"IF(ISNUMBER(Siltumizolācija!G45),Siltumizolācija!E45,\"\")","v":""},{"$f":"IF(ISNUMBER(Siltumizolācija!G45),Siltumizolācija!G45,\"\")","v":""},{"$f":"IF(ISNUMBER(Siltumizolācija!G45),Siltumizolācija!H45,\"\")","v":""},{"$f":"IF(ISTEXT(Siltumizolācija!I45),Siltumizolācija!I45,\"\")","v":""},""]
[{"$f":"IF(ISNUMBER(Siltumizolācija!G46),Siltumizolācija!A46,\"\")","v":""},{"$f":"IF(ISNUMBER(Siltumizolācija!G46),Siltumizolācija!B46,\"\")","v":""},{"$f":"IF(ISNUMBER(Siltumizolācija!G46),Siltumizolācija!C46,\"\")","v":""},{"$f":"IF(ISNUMBER(Siltumizolācija!G46),Siltumizolācija!E46,\"\")","v":""},{"$f":"IF(ISNUMBER(Siltumizolācija!G46),Siltumizolācija!G46,\"\")","v":""},{"$f":"IF(ISNUMBER(Siltumizolācija!G46),Siltumizolācija!H46,\"\")","v":""},{"$f":"IF(ISTEXT(Siltumizolācija!I46),Siltumizolācija!I46,\"\")","v":""},""]
[{"$f":"IF(ISNUMBER(Siltumizolācija!G47),Siltumizolācija!A47,\"\")","v":""},{"$f":"IF(ISNUMBER(Siltumizolācija!G47),Siltumizolācija!B47,\"\")","v":""},{"$f":"IF(ISNUMBER(Siltumizolācija!G47),Siltumizolācija!C47,\"\")","v":""},{"$f":"IF(ISNUMBER(Siltumizolācija!G47),Siltumizolācija!E47,\"\")","v":""},{"$f":"IF(ISNUMBER(Siltumizolācija!G47),Siltumizolācija!G47,\"\")","v":""},{"$f":"IF(ISNUMBER(Siltumizolācija!G47),Siltumizolācija!H47,\"\")","v":""},{"$f":"IF(ISTEXT(Siltumizolācija!I47),Siltumizolācija!I47,\"\")","v":""},""]
[{"$f":"IF(ISNUMBER(Siltumizolācija!G48),Siltumizolācija!A48,\"\")","v":""},{"$f":"IF(ISNUMBER(Siltumizolācija!G48),Siltumizolācija!B48,\"\")","v":""},{"$f":"IF(ISNUMBER(Siltumizolācija!G48),Siltumizolācija!C48,\"\")","v":""},{"$f":"IF(ISNUMBER(Siltumizolācija!G48),Siltumizolācija!E48,\"\")","v":""},{"$f":"IF(ISNUMBER(Siltumizolācija!G48),Siltumizolācija!G48,\"\")","v":""},{"$f":"IF(ISNUMBER(Siltumizolācija!G48),Siltumizolācija!H48,\"\")","v":""},{"$f":"IF(ISTEXT(Siltumizolācija!I48),Siltumizolācija!I48,\"\")","v":""},""]
[{"$f":"IF(ISNUMBER(Siltumizolācija!G49),Siltumizolācija!A49,\"\")","v":""},{"$f":"IF(ISNUMBER(Siltumizolācija!G49),Siltumizolācija!B49,\"\")","v":""},{"$f":"IF(ISNUMBER(Siltumizolācija!G49),Siltumizolācija!C49,\"\")","v":""},{"$f":"IF(ISNUMBER(Siltumizolācija!G49),Siltumizolācija!E49,\"\")","v":""},{"$f":"IF(ISNUMBER(Siltumizolācija!G49),Siltumizolācija!G49,\"\")","v":""},{"$f":"IF(ISNUMBER(Siltumizolācija!G49),Siltumizolācija!H49,\"\")","v":""},{"$f":"IF(ISTEXT(Siltumizolācija!I49),Siltumizolācija!I49,\"\")","v":""},""]
[{"$f":"IF(ISNUMBER(Siltumizolācija!G50),Siltumizolācija!A50,\"\")","v":""},{"$f":"IF(ISNUMBER(Siltumizolācija!G50),Siltumizolācija!B50,\"\")","v":""},{"$f":"IF(ISNUMBER(Siltumizolācija!G50),Siltumizolācija!C50,\"\")","v":""},{"$f":"IF(ISNUMBER(Siltumizolācija!G50),Siltumizolācija!E50,\"\")","v":""},{"$f":"IF(ISNUMBER(Siltumizolācija!G50),Siltumizolācija!G50,\"\")","v":""},{"$f":"IF(ISNUMBER(Siltumizolācija!G50),Siltumizolācija!H50,\"\")","v":""},{"$f":"IF(ISTEXT(Siltumizolācija!I50),Siltumizolācija!I50,\"\")","v":""},""]
[{"$f":"IF(ISNUMBER(Siltumizolācija!G51),Siltumizolācija!A51,\"\")","v":""},{"$f":"IF(ISNUMBER(Siltumizolācija!G51),Siltumizolācija!B51,\"\")","v":""},{"$f":"IF(ISNUMBER(Siltumizolācija!G51),Siltumizolācija!C51,\"\")","v":""},{"$f":"IF(ISNUMBER(Siltumizolācija!G51),Siltumizolācija!E51,\"\")","v":""},{"$f":"IF(ISNUMBER(Siltumizolācija!G51),Siltumizolācija!G51,\"\")","v":""},{"$f":"IF(ISNUMBER(Siltumizolācija!G51),Siltumizolācija!H51,\"\")","v":""},{"$f":"IF(ISTEXT(Siltumizolācija!I51),Siltumizolācija!I51,\"\")","v":""},""]
[{"$f":"IF(ISNUMBER(Siltumizolācija!G52),Siltumizolācija!A52,\"\")","v":""},{"$f":"IF(ISNUMBER(Siltumizolācija!G52),Siltumizolācija!B52,\"\")","v":""},{"$f":"IF(ISNUMBER(Siltumizolācija!G52),Siltumizolācija!C52,\"\")","v":""},{"$f":"IF(ISNUMBER(Siltumizolācija!G52),Siltumizolācija!E52,\"\")","v":""},{"$f":"IF(ISNUMBER(Siltumizolācija!G52),Siltumizolācija!G52,\"\")","v":""},{"$f":"IF(ISNUMBER(Siltumizolācija!G52),Siltumizolācija!H52,\"\")","v":""},{"$f":"IF(ISTEXT(Siltumizolācija!I52),Siltumizolācija!I52,\"\")","v":""},""]
[{"$f":"IF(ISNUMBER(Siltumizolācija!G53),Siltumizolācija!A53,\"\")","v":""},{"$f":"IF(ISNUMBER(Siltumizolācija!G53),Siltumizolācija!B53,\"\")","v":""},{"$f":"IF(ISNUMBER(Siltumizolācija!G53),Siltumizolācija!C53,\"\")","v":""},{"$f":"IF(ISNUMBER(Siltumizolācija!G53),Siltumizolācija!E53,\"\")","v":""},{"$f":"IF(ISNUMBER(Siltumizolācija!G53),Siltumizolācija!G53,\"\")","v":""},{"$f":"IF(ISNUMBER(Siltumizolācija!G53),Siltumizolācija!H53,\"\")","v":""},{"$f":"IF(ISTEXT(Siltumizolācija!I53),Siltumizolācija!I53,\"\")","v":""},""]
[{"$f":"IF(ISNUMBER(Siltumizolācija!G54),Siltumizolācija!A54,\"\")","v":""},{"$f":"IF(ISNUMBER(Siltumizolācija!G54),Siltumizolācija!B54,\"\")","v":""},{"$f":"IF(ISNUMBER(Siltumizolācija!G54),Siltumizolācija!C54,\"\")","v":""},{"$f":"IF(ISNUMBER(Siltumizolācija!G54),Siltumizolācija!E54,\"\")","v":""},{"$f":"IF(ISNUMBER(Siltumizolācija!G54),Siltumizolācija!G54,\"\")","v":""},{"$f":"IF(ISNUMBER(Siltumizolācija!G54),Siltumizolācija!H54,\"\")","v":""},{"$f":"IF(ISTEXT(Siltumizolācija!I54),Siltumizolācija!I54,\"\")","v":""},""]
[{"$f":"IF(ISNUMBER(Siltumizolācija!G55),Siltumizolācija!A55,\"\")","v":""},{"$f":"IF(ISNUMBER(Siltumizolācija!G55),Siltumizolācija!B55,\"\")","v":""},{"$f":"IF(ISNUMBER(Siltumizolācija!G55),Siltumizolācija!C55,\"\")","v":""},{"$f":"IF(ISNUMBER(Siltumizolācija!G55),Siltumizolācija!E55,\"\")","v":""},{"$f":"IF(ISNUMBER(Siltumizolācija!G55),Siltumizolācija!G55,\"\")","v":""},{"$f":"IF(ISNUMBER(Siltumizolācija!G55),Siltumizolācija!H55,\"\")","v":""},{"$f":"IF(ISTEXT(Siltumizolācija!I55),Siltumizolācija!I55,\"\")","v":""},""]
[{"$f":"IF(ISNUMBER(Siltumizolācija!G56),Siltumizolācija!A56,\"\")","v":""},{"$f":"IF(ISNUMBER(Siltumizolācija!G56),Siltumizolācija!B56,\"\")","v":""},{"$f":"IF(ISNUMBER(Siltumizolācija!G56),Siltumizolācija!C56,\"\")","v":""},{"$f":"IF(ISNUMBER(Siltumizolācija!G56),Siltumizolācija!E56,\"\")","v":""},{"$f":"IF(ISNUMBER(Siltumizolācija!G56),Siltumizolācija!G56,\"\")","v":""},{"$f":"IF(ISNUMBER(Siltumizolācija!G56),Siltumizolācija!H56,\"\")","v":""},{"$f":"IF(ISTEXT(Siltumizolācija!I56),Siltumizolācija!I56,\"\")","v":""},""]
[{"$f":"IF(ISNUMBER(Siltumizolācija!G57),Siltumizolācija!A57,\"\")","v":""},{"$f":"IF(ISNUMBER(Siltumizolācija!G57),Siltumizolācija!B57,\"\")","v":""},{"$f":"IF(ISNUMBER(Siltumizolācija!G57),Siltumizolācija!C57,\"\")","v":""},{"$f":"IF(ISNUMBER(Siltumizolācija!G57),Siltumizolācija!E57,\"\")","v":""},{"$f":"IF(ISNUMBER(Siltumizolācija!G57),Siltumizolācija!G57,\"\")","v":""},{"$f":"IF(ISNUMBER(Siltumizolācija!G57),Siltumizolācija!H57,\"\")","v":""},{"$f":"IF(ISTEXT(Siltumizolācija!I57),Siltumizolācija!I57,\"\")","v":""},""]
[{"$f":"IF(ISNUMBER(Siltumizolācija!G58),Siltumizolācija!A58,\"\")","v":""},{"$f":"IF(ISNUMBER(Siltumizolācija!G58),Siltumizolācija!B58,\"\")","v":""},{"$f":"IF(ISNUMBER(Siltumizolācija!G58),Siltumizolācija!C58,\"\")","v":""},{"$f":"IF(ISNUMBER(Siltumizolācija!G58),Siltumizolācija!E58,\"\")","v":""},{"$f":"IF(ISNUMBER(Siltumizolācija!G58),Siltumizolācija!G58,\"\")","v":""},{"$f":"IF(ISNUMBER(Siltumizolācija!G58),Siltumizolācija!H58,\"\")","v":""},{"$f":"IF(ISTEXT(Siltumizolācija!I58),Siltumizolācija!I58,\"\")","v":""},""]
[{"$f":"IF(ISNUMBER(Siltumizolācija!G59),Siltumizolācija!A59,\"\")","v":""},{"$f":"IF(ISNUMBER(Siltumizolācija!G59),Siltumizolācija!B59,\"\")","v":""},{"$f":"IF(ISNUMBER(Siltumizolācija!G59),Siltumizolācija!C59,\"\")","v":""},{"$f":"IF(ISNUMBER(Siltumizolācija!G59),Siltumizolācija!E59,\"\")","v":""},{"$f":"IF(ISNUMBER(Siltumizolācija!G59),Siltumizolācija!G59,\"\")","v":""},{"$f":"IF(ISNUMBER(Siltumizolācija!G59),Siltumizolācija!H59,\"\")","v":""},{"$f":"IF(ISTEXT(Siltumizolācija!I59),Siltumizolācija!I59,\"\")","v":""},""]
[{"$f":"IF(ISNUMBER(Siltumizolācija!G60),Siltumizolācija!A60,\"\")","v":""},{"$f":"IF(ISNUMBER(Siltumizolācija!G60),Siltumizolācija!B60,\"\")","v":""},{"$f":"IF(ISNUMBER(Siltumizolācija!G60),Siltumizolācija!C60,\"\")","v":""},{"$f":"IF(ISNUMBER(Siltumizolācija!G60),Siltumizolācija!E60,\"\")","v":""},{"$f":"IF(ISNUMBER(Siltumizolācija!G60),Siltumizolācija!G60,\"\")","v":""},{"$f":"IF(ISNUMBER(Siltumizolācija!G60),Siltumizolācija!H60,\"\")","v":""},{"$f":"IF(ISTEXT(Siltumizolācija!I60),Siltumizolācija!I60,\"\")","v":""},""]
[{"$f":"IF(ISNUMBER(Siltumizolācija!G61),Siltumizolācija!A61,\"\")","v":""},{"$f":"IF(ISNUMBER(Siltumizolācija!G61),Siltumizolācija!B61,\"\")","v":""},{"$f":"IF(ISNUMBER(Siltumizolācija!G61),Siltumizolācija!C61,\"\")","v":""},{"$f":"IF(ISNUMBER(Siltumizolācija!G61),Siltumizolācija!E61,\"\")","v":""},{"$f":"IF(ISNUMBER(Siltumizolācija!G61),Siltumizolācija!G61,\"\")","v":""},{"$f":"IF(ISNUMBER(Siltumizolācija!G61),Siltumizolācija!H61,\"\")","v":""},{"$f":"IF(ISTEXT(Siltumizolācija!I61),Siltumizolācija!I61,\"\")","v":""},""]
[{"$f":"IF(ISNUMBER(Siltumizolācija!G62),Siltumizolācija!A62,\"\")","v":""},{"$f":"IF(ISNUMBER(Siltumizolācija!G62),Siltumizolācija!B62,\"\")","v":""},{"$f":"IF(ISNUMBER(Siltumizolācija!G62),Siltumizolācija!C62,\"\")","v":""},{"$f":"IF(ISNUMBER(Siltumizolācija!G62),Siltumizolācija!E62,\"\")","v":""},{"$f":"IF(ISNUMBER(Siltumizolācija!G62),Siltumizolācija!G62,\"\")","v":""},{"$f":"IF(ISNUMBER(Siltumizolācija!G62),Siltumizolācija!H62,\"\")","v":""},{"$f":"IF(ISTEXT(Siltumizolācija!I62),Siltumizolācija!I62,\"\")","v":""},""]
[{"$f":"IF(ISNUMBER(Siltumizolācija!G63),Siltumizolācija!A63,\"\")","v":""},{"$f":"IF(ISNUMBER(Siltumizolācija!G63),Siltumizolācija!B63,\"\")","v":""},{"$f":"IF(ISNUMBER(Siltumizolācija!G63),Siltumizolācija!C63,\"\")","v":""},{"$f":"IF(ISNUMBER(Siltumizolācija!G63),Siltumizolācija!E63,\"\")","v":""},{"$f":"IF(ISNUMBER(Siltumizolācija!G63),Siltumizolācija!G63,\"\")","v":""},{"$f":"IF(ISNUMBER(Siltumizolācija!G63),Siltumizolācija!H63,\"\")","v":""},{"$f":"IF(ISTEXT(Siltumizolācija!I63),Siltumizolācija!I63,\"\")","v":""},""]
[{"$f":"IF(ISNUMBER(Siltumizolācija!G64),Siltumizolācija!A64,\"\")","v":""},{"$f":"IF(ISNUMBER(Siltumizolācija!G64),Siltumizolācija!B64,\"\")","v":""},{"$f":"IF(ISNUMBER(Siltumizolācija!G64),Siltumizolācija!C64,\"\")","v":""},{"$f":"IF(ISNUMBER(Siltumizolācija!G64),Siltumizolācija!E64,\"\")","v":""},{"$f":"IF(ISNUMBER(Siltumizolācija!G64),Siltumizolācija!G64,\"\")","v":""},{"$f":"IF(ISNUMBER(Siltumizolācija!G64),Siltumizolācija!H64,\"\")","v":""},{"$f":"IF(ISTEXT(Siltumizolācija!I64),Siltumizolācija!I64,\"\")","v":""},""]
[{"$f":"IF(ISNUMBER(Siltumizolācija!G65),Siltumizolācija!A65,\"\")","v":""},{"$f":"IF(ISNUMBER(Siltumizolācija!G65),Siltumizolācija!B65,\"\")","v":""},{"$f":"IF(ISNUMBER(Siltumizolācija!G65),Siltumizolācija!C65,\"\")","v":""},{"$f":"IF(ISNUMBER(Siltumizolācija!G65),Siltumizolācija!E65,\"\")","v":""},{"$f":"IF(ISNUMBER(Siltumizolācija!G65),Siltumizolācija!G65,\"\")","v":""},{"$f":"IF(ISNUMBER(Siltumizolācija!G65),Siltumizolācija!H65,\"\")","v":""},{"$f":"IF(ISTEXT(Siltumizolācija!I65),Siltumizolācija!I65,\"\")","v":""},""]
[{"$f":"IF(ISNUMBER(Siltumizolācija!G66),Siltumizolācija!A66,\"\")","v":""},{"$f":"IF(ISNUMBER(Siltumizolācija!G66),Siltumizolācija!B66,\"\")","v":""},{"$f":"IF(ISNUMBER(Siltumizolācija!G66),Siltumizolācija!C66,\"\")","v":""},{"$f":"IF(ISNUMBER(Siltumizolācija!G66),Siltumizolācija!E66,\"\")","v":""},{"$f":"IF(ISNUMBER(Siltumizolācija!G66),Siltumizolācija!G66,\"\")","v":""},{"$f":"IF(ISNUMBER(Siltumizolācija!G66),Siltumizolācija!H66,\"\")","v":""},{"$f":"IF(ISTEXT(Siltumizolācija!I66),Siltumizolācija!I66,\"\")","v":""},""]
[{"$f":"IF(ISNUMBER(Siltumizolācija!G67),Siltumizolācija!A67,\"\")","v":""},{"$f":"IF(ISNUMBER(Siltumizolācija!G67),Siltumizolācija!B67,\"\")","v":""},{"$f":"IF(ISNUMBER(Siltumizolācija!G67),Siltumizolācija!C67,\"\")","v":""},{"$f":"IF(ISNUMBER(Siltumizolācija!G67),Siltumizolācija!E67,\"\")","v":""},{"$f":"IF(ISNUMBER(Siltumizolācija!G67),Siltumizolācija!G67,\"\")","v":""},{"$f":"IF(ISNUMBER(Siltumizolācija!G67),Siltumizolācija!H67,\"\")","v":""},{"$f":"IF(ISTEXT(Siltumizolācija!I67),Siltumizolācija!I67,\"\")","v":""},{"$f":"IF(ISNUMBER(E351),\"yes\",\"\")","v":""}]
[{"$f":"IF(ISNUMBER(Siltumizolācija!G68),Siltumizolācija!A68,\"\")","v":""},{"$f":"IF(ISNUMBER(Siltumizolācija!G68),Siltumizolācija!B68,\"\")","v":""},{"$f":"IF(ISNUMBER(Siltumizolācija!G68),Siltumizolācija!C68,\"\")","v":""},{"$f":"IF(ISNUMBER(Siltumizolācija!G68),Siltumizolācija!E68,\"\")","v":""},{"$f":"IF(ISNUMBER(Siltumizolācija!G68),Siltumizolācija!G68,\"\")","v":""},{"$f":"IF(ISNUMBER(Siltumizolācija!G68),Siltumizolācija!H68,\"\")","v":""},{"$f":"IF(ISTEXT(Siltumizolācija!I68),Siltumizolācija!I68,\"\")","v":""},""]
[{"$f":"IF(ISNUMBER(Siltumizolācija!G69),Siltumizolācija!A69,\"\")","v":""},{"$f":"IF(ISNUMBER(Siltumizolācija!G69),Siltumizolācija!B69,\"\")","v":""},{"$f":"IF(ISNUMBER(Siltumizolācija!G69),Siltumizolācija!C69,\"\")","v":""},{"$f":"IF(ISNUMBER(Siltumizolācija!G69),Siltumizolācija!E69,\"\")","v":""},{"$f":"IF(ISNUMBER(Siltumizolācija!G69),Siltumizolācija!G69,\"\")","v":""},{"$f":"IF(ISNUMBER(Siltumizolācija!G69),Siltumizolācija!H69,\"\")","v":""},{"$f":"IF(ISTEXT(Siltumizolācija!I69),Siltumizolācija!I69,\"\")","v":""},""]
[{"$f":"IF(ISNUMBER(Siltumizolācija!G70),Siltumizolācija!A70,\"\")","v":""},{"$f":"IF(ISNUMBER(Siltumizolācija!G70),Siltumizolācija!B70,\"\")","v":""},{"$f":"IF(ISNUMBER(Siltumizolācija!G70),Siltumizolācija!C70,\"\")","v":""},{"$f":"IF(ISNUMBER(Siltumizolācija!G70),Siltumizolācija!E70,\"\")","v":""},{"$f":"IF(ISNUMBER(Siltumizolācija!G70),Siltumizolācija!G70,\"\")","v":""},{"$f":"IF(ISNUMBER(Siltumizolācija!G70),Siltumizolācija!H70,\"\")","v":""},{"$f":"IF(ISTEXT(Siltumizolācija!I70),Siltumizolācija!I70,\"\")","v":""},""]
[{"$f":"IF(ISNUMBER(Siltumizolācija!G71),Siltumizolācija!A71,\"\")","v":""},{"$f":"IF(ISNUMBER(Siltumizolācija!G71),Siltumizolācija!B71,\"\")","v":""},{"$f":"IF(ISNUMBER(Siltumizolācija!G71),Siltumizolācija!C71,\"\")","v":""},{"$f":"IF(ISNUMBER(Siltumizolācija!G71),Siltumizolācija!E71,\"\")","v":""},{"$f":"IF(ISNUMBER(Siltumizolācija!G71),Siltumizolācija!G71,\"\")","v":""},{"$f":"IF(ISNUMBER(Siltumizolācija!G71),Siltumizolācija!H71,\"\")","v":""},{"$f":"IF(ISTEXT(Siltumizolācija!I71),Siltumizolācija!I71,\"\")","v":""},""]
[{"$f":"IF(ISNUMBER(Siltumizolācija!G72),Siltumizolācija!A72,\"\")","v":""},{"$f":"IF(ISNUMBER(Siltumizolācija!G72),Siltumizolācija!B72,\"\")","v":""},{"$f":"IF(ISNUMBER(Siltumizolācija!G72),Siltumizolācija!C72,\"\")","v":""},{"$f":"IF(ISNUMBER(Siltumizolācija!G72),Siltumizolācija!E72,\"\")","v":""},{"$f":"IF(ISNUMBER(Siltumizolācija!G72),Siltumizolācija!G72,\"\")","v":""},{"$f":"IF(ISNUMBER(Siltumizolācija!G72),Siltumizolācija!H72,\"\")","v":""},{"$f":"IF(ISTEXT(Siltumizolācija!I72),Siltumizolācija!I72,\"\")","v":""},""]
[{"$f":"IF(ISNUMBER(Siltumizolācija!G73),Siltumizolācija!A73,\"\")","v":""},{"$f":"IF(ISNUMBER(Siltumizolācija!G73),Siltumizolācija!B73,\"\")","v":""},{"$f":"IF(ISNUMBER(Siltumizolācija!G73),Siltumizolācija!C73,\"\")","v":""},{"$f":"IF(ISNUMBER(Siltumizolācija!G73),Siltumizolācija!E73,\"\")","v":""},{"$f":"IF(ISNUMBER(Siltumizolācija!G73),Siltumizolācija!G73,\"\")","v":""},{"$f":"IF(ISNUMBER(Siltumizolācija!G73),Siltumizolācija!H73,\"\")","v":""},{"$f":"IF(ISTEXT(Siltumizolācija!I73),Siltumizolācija!I73,\"\")","v":""},""]
[{"$f":"IF(ISNUMBER(Siltumizolācija!G74),Siltumizolācija!A74,\"\")","v":""},{"$f":"IF(ISNUMBER(Siltumizolācija!G74),Siltumizolācija!B74,\"\")","v":""},{"$f":"IF(ISNUMBER(Siltumizolācija!G74),Siltumizolācija!C74,\"\")","v":""},{"$f":"IF(ISNUMBER(Siltumizolācija!G74),Siltumizolācija!E74,\"\")","v":""},{"$f":"IF(ISNUMBER(Siltumizolācija!G74),Siltumizolācija!G74,\"\")","v":""},{"$f":"IF(ISNUMBER(Siltumizolācija!G74),Siltumizolācija!H74,\"\")","v":""},{"$f":"IF(ISTEXT(Siltumizolācija!I74),Siltumizolācija!I74,\"\")","v":""},""]
[{"$f":"IF(ISNUMBER(Siltumizolācija!G75),Siltumizolācija!A75,\"\")","v":""},{"$f":"IF(ISNUMBER(Siltumizolācija!G75),Siltumizolācija!B75,\"\")","v":""},{"$f":"IF(ISNUMBER(Siltumizolācija!G75),Siltumizolācija!C75,\"\")","v":""},{"$f":"IF(ISNUMBER(Siltumizolācija!G75),Siltumizolācija!E75,\"\")","v":""},{"$f":"IF(ISNUMBER(Siltumizolācija!G75),Siltumizolācija!G75,\"\")","v":""},{"$f":"IF(ISNUMBER(Siltumizolācija!G75),Siltumizolācija!H75,\"\")","v":""},{"$f":"IF(ISTEXT(Siltumizolācija!I75),Siltumizolācija!I75,\"\")","v":""},""]
[{"$f":"IF(ISNUMBER(Siltumizolācija!G76),Siltumizolācija!A76,\"\")","v":""},{"$f":"IF(ISNUMBER(Siltumizolācija!G76),Siltumizolācija!B76,\"\")","v":""},{"$f":"IF(ISNUMBER(Siltumizolācija!G76),Siltumizolācija!C76,\"\")","v":""},{"$f":"IF(ISNUMBER(Siltumizolācija!G76),Siltumizolācija!E76,\"\")","v":""},{"$f":"IF(ISNUMBER(Siltumizolācija!G76),Siltumizolācija!G76,\"\")","v":""},{"$f":"IF(ISNUMBER(Siltumizolācija!G76),Siltumizolācija!H76,\"\")","v":""},{"$f":"IF(ISTEXT(Siltumizolācija!I76),Siltumizolācija!I76,\"\")","v":""},""]
[{"$f":"IF(ISNUMBER(Siltumizolācija!G77),Siltumizolācija!A77,\"\")","v":""},{"$f":"IF(ISNUMBER(Siltumizolācija!G77),Siltumizolācija!B77,\"\")","v":""},{"$f":"IF(ISNUMBER(Siltumizolācija!G77),Siltumizolācija!C77,\"\")","v":""},{"$f":"IF(ISNUMBER(Siltumizolācija!G77),Siltumizolācija!E77,\"\")","v":""},{"$f":"IF(ISNUMBER(Siltumizolācija!G77),Siltumizolācija!G77,\"\")","v":""},{"$f":"IF(ISNUMBER(Siltumizolācija!G77),Siltumizolācija!H77,\"\")","v":""},{"$f":"IF(ISTEXT(Siltumizolācija!I77),Siltumizolācija!I77,\"\")","v":""},""]
[{"$f":"IF(ISNUMBER(Siltumizolācija!G78),Siltumizolācija!A78,\"\")","v":""},{"$f":"IF(ISNUMBER(Siltumizolācija!G78),Siltumizolācija!B78,\"\")","v":""},{"$f":"IF(ISNUMBER(Siltumizolācija!G78),Siltumizolācija!C78,\"\")","v":""},{"$f":"IF(ISNUMBER(Siltumizolācija!G78),Siltumizolācija!E78,\"\")","v":""},{"$f":"IF(ISNUMBER(Siltumizolācija!G78),Siltumizolācija!G78,\"\")","v":""},{"$f":"IF(ISNUMBER(Siltumizolācija!G78),Siltumizolācija!H78,\"\")","v":""},{"$f":"IF(ISTEXT(Siltumizolācija!I78),Siltumizolācija!I78,\"\")","v":""},""]
[{"$f":"IF(ISNUMBER(Siltumizolācija!G79),Siltumizolācija!A79,\"\")","v":""},{"$f":"IF(ISNUMBER(Siltumizolācija!G79),Siltumizolācija!B79,\"\")","v":""},{"$f":"IF(ISNUMBER(Siltumizolācija!G79),Siltumizolācija!C79,\"\")","v":""},{"$f":"IF(ISNUMBER(Siltumizolācija!G79),Siltumizolācija!E79,\"\")","v":""},{"$f":"IF(ISNUMBER(Siltumizolācija!G79),Siltumizolācija!G79,\"\")","v":""},{"$f":"IF(ISNUMBER(Siltumizolācija!G79),Siltumizolācija!H79,\"\")","v":""},{"$f":"IF(ISTEXT(Siltumizolācija!I79),Siltumizolācija!I79,\"\")","v":""},""]
[{"$f":"IF(ISNUMBER(Siltumizolācija!G80),Siltumizolācija!A80,\"\")","v":""},{"$f":"IF(ISNUMBER(Siltumizolācija!G80),Siltumizolācija!B80,\"\")","v":""},{"$f":"IF(ISNUMBER(Siltumizolācija!G80),Siltumizolācija!C80,\"\")","v":""},{"$f":"IF(ISNUMBER(Siltumizolācija!G80),Siltumizolācija!E80,\"\")","v":""},{"$f":"IF(ISNUMBER(Siltumizolācija!G80),Siltumizolācija!G80,\"\")","v":""},{"$f":"IF(ISNUMBER(Siltumizolācija!G80),Siltumizolācija!H80,\"\")","v":""},{"$f":"IF(ISTEXT(Siltumizolācija!I80),Siltumizolācija!I80,\"\")","v":""},""]
[{"$f":"IF(ISNUMBER(Siltumizolācija!G81),Siltumizolācija!A81,\"\")","v":""},{"$f":"IF(ISNUMBER(Siltumizolācija!G81),Siltumizolācija!B81,\"\")","v":""},{"$f":"IF(ISNUMBER(Siltumizolācija!G81),Siltumizolācija!C81,\"\")","v":""},{"$f":"IF(ISNUMBER(Siltumizolācija!G81),Siltumizolācija!E81,\"\")","v":""},{"$f":"IF(ISNUMBER(Siltumizolācija!G81),Siltumizolācija!G81,\"\")","v":""},{"$f":"IF(ISNUMBER(Siltumizolācija!G81),Siltumizolācija!H81,\"\")","v":""},{"$f":"IF(ISTEXT(Siltumizolācija!I81),Siltumizolācija!I81,\"\")","v":""},""]
[{"$f":"IF(ISNUMBER(Siltumizolācija!G82),Siltumizolācija!A82,\"\")","v":""},{"$f":"IF(ISNUMBER(Siltumizolācija!G82),Siltumizolācija!B82,\"\")","v":""},{"$f":"IF(ISNUMBER(Siltumizolācija!G82),Siltumizolācija!C82,\"\")","v":""},{"$f":"IF(ISNUMBER(Siltumizolācija!G82),Siltumizolācija!E82,\"\")","v":""},{"$f":"IF(ISNUMBER(Siltumizolācija!G82),Siltumizolācija!G82,\"\")","v":""},{"$f":"IF(ISNUMBER(Siltumizolācija!G82),Siltumizolācija!H82,\"\")","v":""},{"$f":"IF(ISTEXT(Siltumizolācija!I82),Siltumizolācija!I82,\"\")","v":""},""]
[{"$f":"IF(ISNUMBER(Siltumizolācija!G83),Siltumizolācija!A83,\"\")","v":""},{"$f":"IF(ISNUMBER(Siltumizolācija!G83),Siltumizolācija!B83,\"\")","v":""},{"$f":"IF(ISNUMBER(Siltumizolācija!G83),Siltumizolācija!C83,\"\")","v":""},{"$f":"IF(ISNUMBER(Siltumizolācija!G83),Siltumizolācija!E83,\"\")","v":""},{"$f":"IF(ISNUMBER(Siltumizolācija!G83),Siltumizolācija!G83,\"\")","v":""},{"$f":"IF(ISNUMBER(Siltumizolācija!G83),Siltumizolācija!H83,\"\")","v":""},{"$f":"IF(ISTEXT(Siltumizolācija!I83),Siltumizolācija!I83,\"\")","v":""},""]
[{"$f":"IF(ISNUMBER(Siltumizolācija!G84),Siltumizolācija!A84,\"\")","v":""},{"$f":"IF(ISNUMBER(Siltumizolācija!G84),Siltumizolācija!B84,\"\")","v":""},{"$f":"IF(ISNUMBER(Siltumizolācija!G84),Siltumizolācija!C84,\"\")","v":""},{"$f":"IF(ISNUMBER(Siltumizolācija!G84),Siltumizolācija!E84,\"\")","v":""},{"$f":"IF(ISNUMBER(Siltumizolācija!G84),Siltumizolācija!G84,\"\")","v":""},{"$f":"IF(ISNUMBER(Siltumizolācija!G84),Siltumizolācija!H84,\"\")","v":""},{"$f":"IF(ISTEXT(Siltumizolācija!I84),Siltumizolācija!I84,\"\")","v":""},""]
[{"$f":"IF(ISNUMBER(Siltumizolācija!G85),Siltumizolācija!A85,\"\")","v":""},{"$f":"IF(ISNUMBER(Siltumizolācija!G85),Siltumizolācija!B85,\"\")","v":""},{"$f":"IF(ISNUMBER(Siltumizolācija!G85),Siltumizolācija!C85,\"\")","v":""},{"$f":"IF(ISNUMBER(Siltumizolācija!G85),Siltumizolācija!E85,\"\")","v":""},{"$f":"IF(ISNUMBER(Siltumizolācija!G85),Siltumizolācija!G85,\"\")","v":""},{"$f":"IF(ISNUMBER(Siltumizolācija!G85),Siltumizolācija!H85,\"\")","v":""},{"$f":"IF(ISTEXT(Siltumizolācija!I85),Siltumizolācija!I85,\"\")","v":""},""]
[{"$f":"IF(ISNUMBER(Siltumizolācija!G86),Siltumizolācija!A86,\"\")","v":""},{"$f":"IF(ISNUMBER(Siltumizolācija!G86),Siltumizolācija!B86,\"\")","v":""},{"$f":"IF(ISNUMBER(Siltumizolācija!G86),Siltumizolācija!C86,\"\")","v":""},{"$f":"IF(ISNUMBER(Siltumizolācija!G86),Siltumizolācija!E86,\"\")","v":""},{"$f":"IF(ISNUMBER(Siltumizolācija!G86),Siltumizolācija!G86,\"\")","v":""},{"$f":"IF(ISNUMBER(Siltumizolācija!G86),Siltumizolācija!H86,\"\")","v":""},{"$f":"IF(ISTEXT(Siltumizolācija!I86),Siltumizolācija!I86,\"\")","v":""},""]
[{"$f":"IF(ISNUMBER(Siltumizolācija!G87),Siltumizolācija!A87,\"\")","v":""},{"$f":"IF(ISNUMBER(Siltumizolācija!G87),Siltumizolācija!B87,\"\")","v":""},{"$f":"IF(ISNUMBER(Siltumizolācija!G87),Siltumizolācija!C87,\"\")","v":""},{"$f":"IF(ISNUMBER(Siltumizolācija!G87),Siltumizolācija!E87,\"\")","v":""},{"$f":"IF(ISNUMBER(Siltumizolācija!G87),Siltumizolācija!G87,\"\")","v":""},{"$f":"IF(ISNUMBER(Siltumizolācija!G87),Siltumizolācija!H87,\"\")","v":""},{"$f":"IF(ISTEXT(Siltumizolācija!I87),Siltumizolācija!I87,\"\")","v":""},""]
[{"$f":"IF(ISNUMBER(Siltumizolācija!G88),Siltumizolācija!A88,\"\")","v":""},{"$f":"IF(ISNUMBER(Siltumizolācija!G88),Siltumizolācija!B88,\"\")","v":""},{"$f":"IF(ISNUMBER(Siltumizolācija!G88),Siltumizolācija!C88,\"\")","v":""},{"$f":"IF(ISNUMBER(Siltumizolācija!G88),Siltumizolācija!E88,\"\")","v":""},{"$f":"IF(ISNUMBER(Siltumizolācija!G88),Siltumizolācija!G88,\"\")","v":""},{"$f":"IF(ISNUMBER(Siltumizolācija!G88),Siltumizolācija!H88,\"\")","v":""},{"$f":"IF(ISTEXT(Siltumizolācija!I88),Siltumizolācija!I88,\"\")","v":""},""]
[{"$f":"IF(ISNUMBER(Siltumizolācija!G89),Siltumizolācija!A89,\"\")","v":""},{"$f":"IF(ISNUMBER(Siltumizolācija!G89),Siltumizolācija!B89,\"\")","v":""},{"$f":"IF(ISNUMBER(Siltumizolācija!G89),Siltumizolācija!C89,\"\")","v":""},{"$f":"IF(ISNUMBER(Siltumizolācija!G89),Siltumizolācija!E89,\"\")","v":""},{"$f":"IF(ISNUMBER(Siltumizolācija!G89),Siltumizolācija!G89,\"\")","v":""},{"$f":"IF(ISNUMBER(Siltumizolācija!G89),Siltumizolācija!H89,\"\")","v":""},{"$f":"IF(ISTEXT(Siltumizolācija!I89),Siltumizolācija!I89,\"\")","v":""},""]
[{"$f":"IF(ISNUMBER(Siltumizolācija!G90),Siltumizolācija!A90,\"\")","v":""},{"$f":"IF(ISNUMBER(Siltumizolācija!G90),Siltumizolācija!B90,\"\")","v":""},{"$f":"IF(ISNUMBER(Siltumizolācija!G90),Siltumizolācija!C90,\"\")","v":""},{"$f":"IF(ISNUMBER(Siltumizolācija!G90),Siltumizolācija!E90,\"\")","v":""},{"$f":"IF(ISNUMBER(Siltumizolācija!G90),Siltumizolācija!G90,\"\")","v":""},{"$f":"IF(ISNUMBER(Siltumizolācija!G90),Siltumizolācija!H90,\"\")","v":""},{"$f":"IF(ISTEXT(Siltumizolācija!I90),Siltumizolācija!I90,\"\")","v":""},""]
[{"$f":"IF(ISNUMBER(Siltumizolācija!G91),Siltumizolācija!A91,\"\")","v":""},{"$f":"IF(ISNUMBER(Siltumizolācija!G91),Siltumizolācija!B91,\"\")","v":""},{"$f":"IF(ISNUMBER(Siltumizolācija!G91),Siltumizolācija!C91,\"\")","v":""},{"$f":"IF(ISNUMBER(Siltumizolācija!G91),Siltumizolācija!E91,\"\")","v":""},{"$f":"IF(ISNUMBER(Siltumizolācija!G91),Siltumizolācija!G91,\"\")","v":""},{"$f":"IF(ISNUMBER(Siltumizolācija!G91),Siltumizolācija!H91,\"\")","v":""},{"$f":"IF(ISTEXT(Siltumizolācija!I91),Siltumizolācija!I91,\"\")","v":""},""]
[{"$f":"IF(ISNUMBER(Siltumizolācija!G92),Siltumizolācija!A92,\"\")","v":""},{"$f":"IF(ISNUMBER(Siltumizolācija!G92),Siltumizolācija!B92,\"\")","v":""},{"$f":"IF(ISNUMBER(Siltumizolācija!G92),Siltumizolācija!C92,\"\")","v":""},{"$f":"IF(ISNUMBER(Siltumizolācija!G92),Siltumizolācija!E92,\"\")","v":""},{"$f":"IF(ISNUMBER(Siltumizolācija!G92),Siltumizolācija!G92,\"\")","v":""},{"$f":"IF(ISNUMBER(Siltumizolācija!G92),Siltumizolācija!H92,\"\")","v":""},{"$f":"IF(ISTEXT(Siltumizolācija!I92),Siltumizolācija!I92,\"\")","v":""},""]
[{"$f":"IF(ISNUMBER(Siltumizolācija!G93),Siltumizolācija!A93,\"\")","v":""},{"$f":"IF(ISNUMBER(Siltumizolācija!G93),Siltumizolācija!B93,\"\")","v":""},{"$f":"IF(ISNUMBER(Siltumizolācija!G93),Siltumizolācija!C93,\"\")","v":""},{"$f":"IF(ISNUMBER(Siltumizolācija!G93),Siltumizolācija!E93,\"\")","v":""},{"$f":"IF(ISNUMBER(Siltumizolācija!G93),Siltumizolācija!G93,\"\")","v":""},{"$f":"IF(ISNUMBER(Siltumizolācija!G93),Siltumizolācija!H93,\"\")","v":""},{"$f":"IF(ISTEXT(Siltumizolācija!I93),Siltumizolācija!I93,\"\")","v":""},""]
[{"$f":"IF(ISNUMBER(Siltumizolācija!G94),Siltumizolācija!A94,\"\")","v":""},{"$f":"IF(ISNUMBER(Siltumizolācija!G94),Siltumizolācija!B94,\"\")","v":""},{"$f":"IF(ISNUMBER(Siltumizolācija!G94),Siltumizolācija!C94,\"\")","v":""},{"$f":"IF(ISNUMBER(Siltumizolācija!G94),Siltumizolācija!E94,\"\")","v":""},{"$f":"IF(ISNUMBER(Siltumizolācija!G94),Siltumizolācija!G94,\"\")","v":""},{"$f":"IF(ISNUMBER(Siltumizolācija!G94),Siltumizolācija!H94,\"\")","v":""},{"$f":"IF(ISTEXT(Siltumizolācija!I94),Siltumizolācija!I94,\"\")","v":""},""]
[]
[]
[{"$f":"IF(ISNUMBER(Transportbetons!G4),Transportbetons!A4,\"\")","v":""},{"$f":"IF(ISNUMBER(Transportbetons!G4),Transportbetons!B4,\"\")","v":""},{"$f":"IF(ISNUMBER(Transportbetons!G4),Transportbetons!C4,\"\")","v":""},{"$f":"IF(ISNUMBER(Transportbetons!G4),Transportbetons!E4,\"\")","v":""},{"$f":"IF(ISNUMBER(Transportbetons!G4),Transportbetons!G4,\"\")","v":""},{"$f":"IF(ISNUMBER(Transportbetons!G4),Transportbetons!H4,\"\")","v":""},{"$f":"IF(ISTEXT(Transportbetons!I4),Transportbetons!I4,\"\")","v":""},{"$f":"IF(ISNUMBER(E381),\"yes\",\"\")","v":""}]
[{"$f":"IF(ISNUMBER(Transportbetons!G5),Transportbetons!A5,\"\")","v":""},{"$f":"IF(ISNUMBER(Transportbetons!G5),Transportbetons!B5,\"\")","v":""},{"$f":"IF(ISNUMBER(Transportbetons!G5),Transportbetons!C5,\"\")","v":""},{"$f":"IF(ISNUMBER(Transportbetons!G5),Transportbetons!E5,\"\")","v":""},{"$f":"IF(ISNUMBER(Transportbetons!G5),Transportbetons!G5,\"\")","v":""},{"$f":"IF(ISNUMBER(Transportbetons!G5),Transportbetons!H5,\"\")","v":""},{"$f":"IF(ISTEXT(Transportbetons!I5),Transportbetons!I5,\"\")","v":""},""]
[{"$f":"IF(ISNUMBER(Transportbetons!G6),Transportbetons!A6,\"\")","v":""},{"$f":"IF(ISNUMBER(Transportbetons!G6),Transportbetons!B6,\"\")","v":""},{"$f":"IF(ISNUMBER(Transportbetons!G6),Transportbetons!C6,\"\")","v":""},{"$f":"IF(ISNUMBER(Transportbetons!G6),Transportbetons!E6,\"\")","v":""},{"$f":"IF(ISNUMBER(Transportbetons!G6),Transportbetons!G6,\"\")","v":""},{"$f":"IF(ISNUMBER(Transportbetons!G6),Transportbetons!H6,\"\")","v":""},{"$f":"IF(ISTEXT(Transportbetons!I6),Transportbetons!I6,\"\")","v":""},""]
[{"$f":"IF(ISNUMBER(Transportbetons!G7),Transportbetons!A7,\"\")","v":""},{"$f":"IF(ISNUMBER(Transportbetons!G7),Transportbetons!B7,\"\")","v":""},{"$f":"IF(ISNUMBER(Transportbetons!G7),Transportbetons!C7,\"\")","v":""},{"$f":"IF(ISNUMBER(Transportbetons!G7),Transportbetons!E7,\"\")","v":""},{"$f":"IF(ISNUMBER(Transportbetons!G7),Transportbetons!G7,\"\")","v":""},{"$f":"IF(ISNUMBER(Transportbetons!G7),Transportbetons!H7,\"\")","v":""},{"$f":"IF(ISTEXT(Transportbetons!I7),Transportbetons!I7,\"\")","v":""},""]
[{"$f":"IF(ISNUMBER(Transportbetons!G8),Transportbetons!A8,\"\")","v":""},{"$f":"IF(ISNUMBER(Transportbetons!G8),Transportbetons!B8,\"\")","v":""},{"$f":"IF(ISNUMBER(Transportbetons!G8),Transportbetons!C8,\"\")","v":""},{"$f":"IF(ISNUMBER(Transportbetons!G8),Transportbetons!E8,\"\")","v":""},{"$f":"IF(ISNUMBER(Transportbetons!G8),Transportbetons!G8,\"\")","v":""},{"$f":"IF(ISNUMBER(Transportbetons!G8),Transportbetons!H8,\"\")","v":""},{"$f":"IF(ISTEXT(Transportbetons!I8),Transportbetons!I8,\"\")","v":""},""]
[{"$f":"IF(ISNUMBER(Transportbetons!G9),Transportbetons!A9,\"\")","v":""},{"$f":"IF(ISNUMBER(Transportbetons!G9),Transportbetons!B9,\"\")","v":""},{"$f":"IF(ISNUMBER(Transportbetons!G9),Transportbetons!C9,\"\")","v":""},{"$f":"IF(ISNUMBER(Transportbetons!G9),Transportbetons!E9,\"\")","v":""},{"$f":"IF(ISNUMBER(Transportbetons!G9),Transportbetons!G9,\"\")","v":""},{"$f":"IF(ISNUMBER(Transportbetons!G9),Transportbetons!H9,\"\")","v":""},{"$f":"IF(ISTEXT(Transportbetons!I9),Transportbetons!I9,\"\")","v":""},""]
[{"$f":"IF(ISNUMBER(Transportbetons!G10),Transportbetons!A10,\"\")","v":""},{"$f":"IF(ISNUMBER(Transportbetons!G10),Transportbetons!B10,\"\")","v":""},{"$f":"IF(ISNUMBER(Transportbetons!G10),Transportbetons!C10,\"\")","v":""},{"$f":"IF(ISNUMBER(Transportbetons!G10),Transportbetons!E10,\"\")","v":""},{"$f":"IF(ISNUMBER(Transportbetons!G10),Transportbetons!G10,\"\")","v":""},{"$f":"IF(ISNUMBER(Transportbetons!G10),Transportbetons!H10,\"\")","v":""},{"$f":"IF(ISTEXT(Transportbetons!I10),Transportbetons!I10,\"\")","v":""},""]
[{"$f":"IF(ISNUMBER(Transportbetons!G11),Transportbetons!A11,\"\")","v":""},{"$f":"IF(ISNUMBER(Transportbetons!G11),Transportbetons!B11,\"\")","v":""},{"$f":"IF(ISNUMBER(Transportbetons!G11),Transportbetons!C11,\"\")","v":""},{"$f":"IF(ISNUMBER(Transportbetons!G11),Transportbetons!E11,\"\")","v":""},{"$f":"IF(ISNUMBER(Transportbetons!G11),Transportbetons!G11,\"\")","v":""},{"$f":"IF(ISNUMBER(Transportbetons!G11),Transportbetons!H11,\"\")","v":""},{"$f":"IF(ISTEXT(Transportbetons!I11),Transportbetons!I11,\"\")","v":""},""]
[{"$f":"IF(ISNUMBER(Transportbetons!G12),Transportbetons!A12,\"\")","v":""},{"$f":"IF(ISNUMBER(Transportbetons!G12),Transportbetons!B12,\"\")","v":""},{"$f":"IF(ISNUMBER(Transportbetons!G12),Transportbetons!C12,\"\")","v":""},{"$f":"IF(ISNUMBER(Transportbetons!G12),Transportbetons!E12,\"\")","v":""},{"$f":"IF(ISNUMBER(Transportbetons!G12),Transportbetons!G12,\"\")","v":""},{"$f":"IF(ISNUMBER(Transportbetons!G12),Transportbetons!H12,\"\")","v":""},{"$f":"IF(ISTEXT(Transportbetons!I12),Transportbetons!I12,\"\")","v":""},""]
[{"$f":"IF(ISNUMBER(Transportbetons!G13),Transportbetons!A13,\"\")","v":""},{"$f":"IF(ISNUMBER(Transportbetons!G13),Transportbetons!B13,\"\")","v":""},{"$f":"IF(ISNUMBER(Transportbetons!G13),Transportbetons!C13,\"\")","v":""},{"$f":"IF(ISNUMBER(Transportbetons!G13),Transportbetons!E13,\"\")","v":""},{"$f":"IF(ISNUMBER(Transportbetons!G13),Transportbetons!G13,\"\")","v":""},{"$f":"IF(ISNUMBER(Transportbetons!G13),Transportbetons!H13,\"\")","v":""},{"$f":"IF(ISTEXT(Transportbetons!I13),Transportbetons!I13,\"\")","v":""},""]
[{"$f":"IF(ISNUMBER(Transportbetons!G14),Transportbetons!A14,\"\")","v":""},{"$f":"IF(ISNUMBER(Transportbetons!G14),Transportbetons!B14,\"\")","v":""},{"$f":"IF(ISNUMBER(Transportbetons!G14),Transportbetons!C14,\"\")","v":""},{"$f":"IF(ISNUMBER(Transportbetons!G14),Transportbetons!E14,\"\")","v":""},{"$f":"IF(ISNUMBER(Transportbetons!G14),Transportbetons!G14,\"\")","v":""},{"$f":"IF(ISNUMBER(Transportbetons!G14),Transportbetons!H14,\"\")","v":""},{"$f":"IF(ISTEXT(Transportbetons!I14),Transportbetons!I14,\"\")","v":""},""]
[{"$f":"IF(ISNUMBER(Transportbetons!G15),Transportbetons!A15,\"\")","v":""},{"$f":"IF(ISNUMBER(Transportbetons!G15),Transportbetons!B15,\"\")","v":""},{"$f":"IF(ISNUMBER(Transportbetons!G15),Transportbetons!C15,\"\")","v":""},{"$f":"IF(ISNUMBER(Transportbetons!G15),Transportbetons!E15,\"\")","v":""},{"$f":"IF(ISNUMBER(Transportbetons!G15),Transportbetons!G15,\"\")","v":""},{"$f":"IF(ISNUMBER(Transportbetons!G15),Transportbetons!H15,\"\")","v":""},{"$f":"IF(ISTEXT(Transportbetons!I15),Transportbetons!I15,\"\")","v":""},""]
[{"$f":"IF(ISNUMBER(Transportbetons!G16),Transportbetons!A16,\"\")","v":""},{"$f":"IF(ISNUMBER(Transportbetons!G16),Transportbetons!B16,\"\")","v":""},{"$f":"IF(ISNUMBER(Transportbetons!G16),Transportbetons!C16,\"\")","v":""},{"$f":"IF(ISNUMBER(Transportbetons!G16),Transportbetons!E16,\"\")","v":""},{"$f":"IF(ISNUMBER(Transportbetons!G16),Transportbetons!G16,\"\")","v":""},{"$f":"IF(ISNUMBER(Transportbetons!G16),Transportbetons!H16,\"\")","v":""},{"$f":"IF(ISTEXT(Transportbetons!I16),Transportbetons!I16,\"\")","v":""},""]
[{"$f":"IF(ISNUMBER(Transportbetons!G17),Transportbetons!A17,\"\")","v":""},{"$f":"IF(ISNUMBER(Transportbetons!G17),Transportbetons!B17,\"\")","v":""},{"$f":"IF(ISNUMBER(Transportbetons!G17),Transportbetons!C17,\"\")","v":""},{"$f":"IF(ISNUMBER(Transportbetons!G17),Transportbetons!E17,\"\")","v":""},{"$f":"IF(ISNUMBER(Transportbetons!G17),Transportbetons!G17,\"\")","v":""},{"$f":"IF(ISNUMBER(Transportbetons!G17),Transportbetons!H17,\"\")","v":""},{"$f":"IF(ISTEXT(Transportbetons!I17),Transportbetons!I17,\"\")","v":""},""]
[{"$f":"IF(ISNUMBER(Transportbetons!G18),Transportbetons!A18,\"\")","v":""},{"$f":"IF(ISNUMBER(Transportbetons!G18),Transportbetons!B18,\"\")","v":""},{"$f":"IF(ISNUMBER(Transportbetons!G18),Transportbetons!C18,\"\")","v":""},{"$f":"IF(ISNUMBER(Transportbetons!G18),Transportbetons!E18,\"\")","v":""},{"$f":"IF(ISNUMBER(Transportbetons!G18),Transportbetons!G18,\"\")","v":""},{"$f":"IF(ISNUMBER(Transportbetons!G18),Transportbetons!H18,\"\")","v":""},{"$f":"IF(ISTEXT(Transportbetons!I18),Transportbetons!I18,\"\")","v":""},""]
[{"$f":"IF(ISNUMBER(Transportbetons!G19),Transportbetons!A19,\"\")","v":""},{"$f":"IF(ISNUMBER(Transportbetons!G19),Transportbetons!B19,\"\")","v":""},{"$f":"IF(ISNUMBER(Transportbetons!G19),Transportbetons!C19,\"\")","v":""},{"$f":"IF(ISNUMBER(Transportbetons!G19),Transportbetons!E19,\"\")","v":""},{"$f":"IF(ISNUMBER(Transportbetons!G19),Transportbetons!G19,\"\")","v":""},{"$f":"IF(ISNUMBER(Transportbetons!G19),Transportbetons!H19,\"\")","v":""},{"$f":"IF(ISTEXT(Transportbetons!I19),Transportbetons!I19,\"\")","v":""},""]
[{"$f":"IF(ISNUMBER(Transportbetons!G20),Transportbetons!A20,\"\")","v":""},{"$f":"IF(ISNUMBER(Transportbetons!G20),Transportbetons!B20,\"\")","v":""},{"$f":"IF(ISNUMBER(Transportbetons!G20),Transportbetons!C20,\"\")","v":""},{"$f":"IF(ISNUMBER(Transportbetons!G20),Transportbetons!E20,\"\")","v":""},{"$f":"IF(ISNUMBER(Transportbetons!G20),Transportbetons!G20,\"\")","v":""},{"$f":"IF(ISNUMBER(Transportbetons!G20),Transportbetons!H20,\"\")","v":""},{"$f":"IF(ISTEXT(Transportbetons!I20),Transportbetons!I20,\"\")","v":""},""]
[{"$f":"IF(ISNUMBER(Transportbetons!G21),Transportbetons!A21,\"\")","v":""},{"$f":"IF(ISNUMBER(Transportbetons!G21),Transportbetons!B21,\"\")","v":""},{"$f":"IF(ISNUMBER(Transportbetons!G21),Transportbetons!C21,\"\")","v":""},{"$f":"IF(ISNUMBER(Transportbetons!G21),Transportbetons!E21,\"\")","v":""},{"$f":"IF(ISNUMBER(Transportbetons!G21),Transportbetons!G21,\"\")","v":""},{"$f":"IF(ISNUMBER(Transportbetons!G21),Transportbetons!H21,\"\")","v":""},{"$f":"IF(ISTEXT(Transportbetons!I21),Transportbetons!I21,\"\")","v":""},""]
[{"$f":"IF(ISNUMBER(Transportbetons!G22),Transportbetons!A22,\"\")","v":""},{"$f":"IF(ISNUMBER(Transportbetons!G22),Transportbetons!B22,\"\")","v":""},{"$f":"IF(ISNUMBER(Transportbetons!G22),Transportbetons!C22,\"\")","v":""},{"$f":"IF(ISNUMBER(Transportbetons!G22),Transportbetons!E22,\"\")","v":""},{"$f":"IF(ISNUMBER(Transportbetons!G22),Transportbetons!G22,\"\")","v":""},{"$f":"IF(ISNUMBER(Transportbetons!G22),Transportbetons!H22,\"\")","v":""},{"$f":"IF(ISTEXT(Transportbetons!I22),Transportbetons!I22,\"\")","v":""},""]
[{"$f":"IF(ISNUMBER(Transportbetons!G23),Transportbetons!A23,\"\")","v":""},{"$f":"IF(ISNUMBER(Transportbetons!G23),Transportbetons!B23,\"\")","v":""},{"$f":"IF(ISNUMBER(Transportbetons!G23),Transportbetons!C23,\"\")","v":""},{"$f":"IF(ISNUMBER(Transportbetons!G23),Transportbetons!E23,\"\")","v":""},{"$f":"IF(ISNUMBER(Transportbetons!G23),Transportbetons!G23,\"\")","v":""},{"$f":"IF(ISNUMBER(Transportbetons!G23),Transportbetons!H23,\"\")","v":""},{"$f":"IF(ISTEXT(Transportbetons!I23),Transportbetons!I23,\"\")","v":""},""]
[{"$f":"IF(ISNUMBER(Transportbetons!G24),Transportbetons!A24,\"\")","v":""},{"$f":"IF(ISNUMBER(Transportbetons!G24),Transportbetons!B24,\"\")","v":""},{"$f":"IF(ISNUMBER(Transportbetons!G24),Transportbetons!C24,\"\")","v":""},{"$f":"IF(ISNUMBER(Transportbetons!G24),Transportbetons!E24,\"\")","v":""},{"$f":"IF(ISNUMBER(Transportbetons!G24),Transportbetons!G24,\"\")","v":""},{"$f":"IF(ISNUMBER(Transportbetons!G24),Transportbetons!H24,\"\")","v":""},{"$f":"IF(ISTEXT(Transportbetons!I24),Transportbetons!I24,\"\")","v":""},""]
[{"$f":"IF(ISNUMBER(Transportbetons!G25),Transportbetons!A25,\"\")","v":""},{"$f":"IF(ISNUMBER(Transportbetons!G25),Transportbetons!B25,\"\")","v":""},{"$f":"IF(ISNUMBER(Transportbetons!G25),Transportbetons!C25,\"\")","v":""},{"$f":"IF(ISNUMBER(Transportbetons!G25),Transportbetons!E25,\"\")","v":""},{"$f":"IF(ISNUMBER(Transportbetons!G25),Transportbetons!G25,\"\")","v":""},{"$f":"IF(ISNUMBER(Transportbetons!G25),Transportbetons!H25,\"\")","v":""},{"$f":"IF(ISTEXT(Transportbetons!I25),Transportbetons!I25,\"\")","v":""},""]
[{"$f":"IF(ISNUMBER(Transportbetons!G26),Transportbetons!A26,\"\")","v":""},{"$f":"IF(ISNUMBER(Transportbetons!G26),Transportbetons!B26,\"\")","v":""},{"$f":"IF(ISNUMBER(Transportbetons!G26),Transportbetons!C26,\"\")","v":""},{"$f":"IF(ISNUMBER(Transportbetons!G26),Transportbetons!E26,\"\")","v":""},{"$f":"IF(ISNUMBER(Transportbetons!G26),Transportbetons!G26,\"\")","v":""},{"$f":"IF(ISNUMBER(Transportbetons!G26),Transportbetons!H26,\"\")","v":""},{"$f":"IF(ISTEXT(Transportbetons!I26),Transportbetons!I26,\"\")","v":""},""]
[{"$f":"IF(ISNUMBER(Transportbetons!G27),Transportbetons!A27,\"\")","v":""},{"$f":"IF(ISNUMBER(Transportbetons!G27),Transportbetons!B27,\"\")","v":""},{"$f":"IF(ISNUMBER(Transportbetons!G27),Transportbetons!C27,\"\")","v":""},{"$f":"IF(ISNUMBER(Transportbetons!G27),Transportbetons!E27,\"\")","v":""},{"$f":"IF(ISNUMBER(Transportbetons!G27),Transportbetons!G27,\"\")","v":""},{"$f":"IF(ISNUMBER(Transportbetons!G27),Transportbetons!H27,\"\")","v":""},{"$f":"IF(ISTEXT(Transportbetons!I27),Transportbetons!I27,\"\")","v":""},""]
[{"$f":"IF(ISNUMBER(Transportbetons!G28),Transportbetons!A28,\"\")","v":""},{"$f":"IF(ISNUMBER(Transportbetons!G28),Transportbetons!B28,\"\")","v":""},{"$f":"IF(ISNUMBER(Transportbetons!G28),Transportbetons!C28,\"\")","v":""},{"$f":"IF(ISNUMBER(Transportbetons!G28),Transportbetons!E28,\"\")","v":""},{"$f":"IF(ISNUMBER(Transportbetons!G28),Transportbetons!G28,\"\")","v":""},{"$f":"IF(ISNUMBER(Transportbetons!G28),Transportbetons!H28,\"\")","v":""},{"$f":"IF(ISTEXT(Transportbetons!I28),Transportbetons!I28,\"\")","v":""},""]
[{"$f":"IF(ISNUMBER(Transportbetons!G29),Transportbetons!A29,\"\")","v":""},{"$f":"IF(ISNUMBER(Transportbetons!G29),Transportbetons!B29,\"\")","v":""},{"$f":"IF(ISNUMBER(Transportbetons!G29),Transportbetons!C29,\"\")","v":""},{"$f":"IF(ISNUMBER(Transportbetons!G29),Transportbetons!E29,\"\")","v":""},{"$f":"IF(ISNUMBER(Transportbetons!G29),Transportbetons!G29,\"\")","v":""},{"$f":"IF(ISNUMBER(Transportbetons!G29),Transportbetons!H29,\"\")","v":""},{"$f":"IF(ISTEXT(Transportbetons!I29),Transportbetons!I29,\"\")","v":""},""]
[{"$f":"IF(ISNUMBER(Transportbetons!G30),Transportbetons!A30,\"\")","v":""},{"$f":"IF(ISNUMBER(Transportbetons!G30),Transportbetons!B30,\"\")","v":""},{"$f":"IF(ISNUMBER(Transportbetons!G30),Transportbetons!C30,\"\")","v":""},{"$f":"IF(ISNUMBER(Transportbetons!G30),Transportbetons!E30,\"\")","v":""},{"$f":"IF(ISNUMBER(Transportbetons!G30),Transportbetons!G30,\"\")","v":""},{"$f":"IF(ISNUMBER(Transportbetons!G30),Transportbetons!H30,\"\")","v":""},{"$f":"IF(ISTEXT(Transportbetons!I30),Transportbetons!I30,\"\")","v":""},""]
[{"$f":"IF(ISNUMBER(Transportbetons!G31),Transportbetons!A31,\"\")","v":""},{"$f":"IF(ISNUMBER(Transportbetons!G31),Transportbetons!B31,\"\")","v":""},{"$f":"IF(ISNUMBER(Transportbetons!G31),Transportbetons!C31,\"\")","v":""},{"$f":"IF(ISNUMBER(Transportbetons!G31),Transportbetons!E31,\"\")","v":""},{"$f":"IF(ISNUMBER(Transportbetons!G31),Transportbetons!G31,\"\")","v":""},{"$f":"IF(ISNUMBER(Transportbetons!G31),Transportbetons!H31,\"\")","v":""},{"$f":"IF(ISTEXT(Transportbetons!I31),Transportbetons!I31,\"\")","v":""},""]
[]
[]
[{"$f":"IF(ISNUMBER(Stiegrojums!G4),Stiegrojums!A4,\"\")","v":""},{"$f":"IF(ISNUMBER(Stiegrojums!G4),Stiegrojums!B4,\"\")","v":""},{"$f":"IF(ISNUMBER(Stiegrojums!G4),Stiegrojums!C4,\"\")","v":""},{"$f":"IF(ISNUMBER(Stiegrojums!G4),Stiegrojums!E4,\"\")","v":""},{"$f":"IF(ISNUMBER(Stiegrojums!G4),Stiegrojums!G4,\"\")","v":""},{"$f":"IF(ISNUMBER(Stiegrojums!G4),Stiegrojums!H4,\"\")","v":""},{"$f":"IF(ISTEXT(Stiegrojums!I4),Stiegrojums!I4,\"\")","v":"1 metra masa 0,22 kg"},{"$f":"IF(ISNUMBER(E411),\"yes\",\"\")","v":""}]
[{"$f":"IF(ISNUMBER(Stiegrojums!G5),Stiegrojums!A5,\"\")","v":""},{"$f":"IF(ISNUMBER(Stiegrojums!G5),Stiegrojums!B5,\"\")","v":""},{"$f":"IF(ISNUMBER(Stiegrojums!G5),Stiegrojums!C5,\"\")","v":""},{"$f":"IF(ISNUMBER(Stiegrojums!G5),Stiegrojums!E5,\"\")","v":""},{"$f":"IF(ISNUMBER(Stiegrojums!G5),Stiegrojums!G5,\"\")","v":""},{"$f":"IF(ISNUMBER(Stiegrojums!G5),Stiegrojums!H5,\"\")","v":""},{"$f":"IF(ISTEXT(Stiegrojums!I5),Stiegrojums!I5,\"\")","v":"1 metra masa 0,40 kg"},""]
[{"$f":"IF(ISNUMBER(Stiegrojums!G6),Stiegrojums!A6,\"\")","v":""},{"$f":"IF(ISNUMBER(Stiegrojums!G6),Stiegrojums!B6,\"\")","v":""},{"$f":"IF(ISNUMBER(Stiegrojums!G6),Stiegrojums!C6,\"\")","v":""},{"$f":"IF(ISNUMBER(Stiegrojums!G6),Stiegrojums!E6,\"\")","v":""},{"$f":"IF(ISNUMBER(Stiegrojums!G6),Stiegrojums!G6,\"\")","v":""},{"$f":"IF(ISNUMBER(Stiegrojums!G6),Stiegrojums!H6,\"\")","v":""},{"$f":"IF(ISTEXT(Stiegrojums!I6),Stiegrojums!I6,\"\")","v":"1 metra masa 0,62 kg"},""]
[{"$f":"IF(ISNUMBER(Stiegrojums!G7),Stiegrojums!A7,\"\")","v":""},{"$f":"IF(ISNUMBER(Stiegrojums!G7),Stiegrojums!B7,\"\")","v":""},{"$f":"IF(ISNUMBER(Stiegrojums!G7),Stiegrojums!C7,\"\")","v":""},{"$f":"IF(ISNUMBER(Stiegrojums!G7),Stiegrojums!E7,\"\")","v":""},{"$f":"IF(ISNUMBER(Stiegrojums!G7),Stiegrojums!G7,\"\")","v":""},{"$f":"IF(ISNUMBER(Stiegrojums!G7),Stiegrojums!H7,\"\")","v":""},{"$f":"IF(ISTEXT(Stiegrojums!I7),Stiegrojums!I7,\"\")","v":"1 metra masa 0,89 kg"},""]
[{"$f":"IF(ISNUMBER(Stiegrojums!G8),Stiegrojums!A8,\"\")","v":""},{"$f":"IF(ISNUMBER(Stiegrojums!G8),Stiegrojums!B8,\"\")","v":""},{"$f":"IF(ISNUMBER(Stiegrojums!G8),Stiegrojums!C8,\"\")","v":""},{"$f":"IF(ISNUMBER(Stiegrojums!G8),Stiegrojums!E8,\"\")","v":""},{"$f":"IF(ISNUMBER(Stiegrojums!G8),Stiegrojums!G8,\"\")","v":""},{"$f":"IF(ISNUMBER(Stiegrojums!G8),Stiegrojums!H8,\"\")","v":""},{"$f":"IF(ISTEXT(Stiegrojums!I8),Stiegrojums!I8,\"\")","v":"1 metra masa 1,21 kg"},""]
[{"$f":"IF(ISNUMBER(Stiegrojums!G9),Stiegrojums!A9,\"\")","v":""},{"$f":"IF(ISNUMBER(Stiegrojums!G9),Stiegrojums!B9,\"\")","v":""},{"$f":"IF(ISNUMBER(Stiegrojums!G9),Stiegrojums!C9,\"\")","v":""},{"$f":"IF(ISNUMBER(Stiegrojums!G9),Stiegrojums!E9,\"\")","v":""},{"$f":"IF(ISNUMBER(Stiegrojums!G9),Stiegrojums!G9,\"\")","v":""},{"$f":"IF(ISNUMBER(Stiegrojums!G9),Stiegrojums!H9,\"\")","v":""},{"$f":"IF(ISTEXT(Stiegrojums!I9),Stiegrojums!I9,\"\")","v":"1 metra masa 1,58 kg"},""]
[{"$f":"IF(ISNUMBER(Stiegrojums!G10),Stiegrojums!A10,\"\")","v":""},{"$f":"IF(ISNUMBER(Stiegrojums!G10),Stiegrojums!B10,\"\")","v":""},{"$f":"IF(ISNUMBER(Stiegrojums!G10),Stiegrojums!C10,\"\")","v":""},{"$f":"IF(ISNUMBER(Stiegrojums!G10),Stiegrojums!E10,\"\")","v":""},{"$f":"IF(ISNUMBER(Stiegrojums!G10),Stiegrojums!G10,\"\")","v":""},{"$f":"IF(ISNUMBER(Stiegrojums!G10),Stiegrojums!H10,\"\")","v":""},{"$f":"IF(ISTEXT(Stiegrojums!I10),Stiegrojums!I10,\"\")","v":"1 metra masa 2,00 kg"},""]
[{"$f":"IF(ISNUMBER(Stiegrojums!G11),Stiegrojums!A11,\"\")","v":""},{"$f":"IF(ISNUMBER(Stiegrojums!G11),Stiegrojums!B11,\"\")","v":""},{"$f":"IF(ISNUMBER(Stiegrojums!G11),Stiegrojums!C11,\"\")","v":""},{"$f":"IF(ISNUMBER(Stiegrojums!G11),Stiegrojums!E11,\"\")","v":""},{"$f":"IF(ISNUMBER(Stiegrojums!G11),Stiegrojums!G11,\"\")","v":""},{"$f":"IF(ISNUMBER(Stiegrojums!G11),Stiegrojums!H11,\"\")","v":""},{"$f":"IF(ISTEXT(Stiegrojums!I11),Stiegrojums!I11,\"\")","v":"1 metra masa 2,47 kg"},""]
[{"$f":"IF(ISNUMBER(Stiegrojums!G12),Stiegrojums!A12,\"\")","v":""},{"$f":"IF(ISNUMBER(Stiegrojums!G12),Stiegrojums!B12,\"\")","v":""},{"$f":"IF(ISNUMBER(Stiegrojums!G12),Stiegrojums!C12,\"\")","v":""},{"$f":"IF(ISNUMBER(Stiegrojums!G12),Stiegrojums!E12,\"\")","v":""},{"$f":"IF(ISNUMBER(Stiegrojums!G12),Stiegrojums!G12,\"\")","v":""},{"$f":"IF(ISNUMBER(Stiegrojums!G12),Stiegrojums!H12,\"\")","v":""},{"$f":"IF(ISTEXT(Stiegrojums!I12),Stiegrojums!I12,\"\")","v":"1 metra masa 2,98 kg"},""]
[{"$f":"IF(ISNUMBER(Stiegrojums!G13),Stiegrojums!A13,\"\")","v":""},{"$f":"IF(ISNUMBER(Stiegrojums!G13),Stiegrojums!B13,\"\")","v":""},{"$f":"IF(ISNUMBER(Stiegrojums!G13),Stiegrojums!C13,\"\")","v":""},{"$f":"IF(ISNUMBER(Stiegrojums!G13),Stiegrojums!E13,\"\")","v":""},{"$f":"IF(ISNUMBER(Stiegrojums!G13),Stiegrojums!G13,\"\")","v":""},{"$f":"IF(ISNUMBER(Stiegrojums!G13),Stiegrojums!H13,\"\")","v":""},{"$f":"IF(ISTEXT(Stiegrojums!I13),Stiegrojums!I13,\"\")","v":"1 metra masa 3,85 kg"},""]
[{"$f":"IF(ISNUMBER(Stiegrojums!G14),Stiegrojums!A14,\"\")","v":""},{"$f":"IF(ISNUMBER(Stiegrojums!G14),Stiegrojums!B14,\"\")","v":""},{"$f":"IF(ISNUMBER(Stiegrojums!G14),Stiegrojums!C14,\"\")","v":""},{"$f":"IF(ISNUMBER(Stiegrojums!G14),Stiegrojums!E14,\"\")","v":""},{"$f":"IF(ISNUMBER(Stiegrojums!G14),Stiegrojums!G14,\"\")","v":""},{"$f":"IF(ISNUMBER(Stiegrojums!G14),Stiegrojums!H14,\"\")","v":""},{"$f":"IF(ISTEXT(Stiegrojums!I14),Stiegrojums!I14,\"\")","v":"1 metra masa 4,83 kg"},""]
[{"$f":"IF(ISNUMBER(Stiegrojums!G15),Stiegrojums!A15,\"\")","v":""},{"$f":"IF(ISNUMBER(Stiegrojums!G15),Stiegrojums!B15,\"\")","v":""},{"$f":"IF(ISNUMBER(Stiegrojums!G15),Stiegrojums!C15,\"\")","v":""},{"$f":"IF(ISNUMBER(Stiegrojums!G15),Stiegrojums!E15,\"\")","v":""},{"$f":"IF(ISNUMBER(Stiegrojums!G15),Stiegrojums!G15,\"\")","v":""},{"$f":"IF(ISNUMBER(Stiegrojums!G15),Stiegrojums!H15,\"\")","v":""},{"$f":"IF(ISTEXT(Stiegrojums!I15),Stiegrojums!I15,\"\")","v":"1 metra masa 6,31 kg"},""]
[{"$f":"IF(ISNUMBER(Stiegrojums!G16),Stiegrojums!A16,\"\")","v":""},{"$f":"IF(ISNUMBER(Stiegrojums!G16),Stiegrojums!B16,\"\")","v":""},{"$f":"IF(ISNUMBER(Stiegrojums!G16),Stiegrojums!C16,\"\")","v":""},{"$f":"IF(ISNUMBER(Stiegrojums!G16),Stiegrojums!E16,\"\")","v":""},{"$f":"IF(ISNUMBER(Stiegrojums!G16),Stiegrojums!G16,\"\")","v":""},{"$f":"IF(ISNUMBER(Stiegrojums!G16),Stiegrojums!H16,\"\")","v":""},{"$f":"IF(ISTEXT(Stiegrojums!I16),Stiegrojums!I16,\"\")","v":""},""]
[{"$f":"IF(ISNUMBER(Stiegrojums!G17),Stiegrojums!A17,\"\")","v":""},{"$f":"IF(ISNUMBER(Stiegrojums!G17),Stiegrojums!B17,\"\")","v":""},{"$f":"IF(ISNUMBER(Stiegrojums!G17),Stiegrojums!C17,\"\")","v":""},{"$f":"IF(ISNUMBER(Stiegrojums!G17),Stiegrojums!E17,\"\")","v":""},{"$f":"IF(ISNUMBER(Stiegrojums!G17),Stiegrojums!G17,\"\")","v":""},{"$f":"IF(ISNUMBER(Stiegrojums!G17),Stiegrojums!H17,\"\")","v":""},{"$f":"IF(ISTEXT(Stiegrojums!I17),Stiegrojums!I17,\"\")","v":""},""]
[{"$f":"IF(ISNUMBER(Stiegrojums!G18),Stiegrojums!A18,\"\")","v":""},{"$f":"IF(ISNUMBER(Stiegrojums!G18),Stiegrojums!B18,\"\")","v":""},{"$f":"IF(ISNUMBER(Stiegrojums!G18),Stiegrojums!C18,\"\")","v":""},{"$f":"IF(ISNUMBER(Stiegrojums!G18),Stiegrojums!E18,\"\")","v":""},{"$f":"IF(ISNUMBER(Stiegrojums!G18),Stiegrojums!G18,\"\")","v":""},{"$f":"IF(ISNUMBER(Stiegrojums!G18),Stiegrojums!H18,\"\")","v":""},{"$f":"IF(ISTEXT(Stiegrojums!I18),Stiegrojums!I18,\"\")","v":""},""]
[{"$f":"IF(ISNUMBER(Stiegrojums!G19),Stiegrojums!A19,\"\")","v":""},{"$f":"IF(ISNUMBER(Stiegrojums!G19),Stiegrojums!B19,\"\")","v":""},{"$f":"IF(ISNUMBER(Stiegrojums!G19),Stiegrojums!C19,\"\")","v":""},{"$f":"IF(ISNUMBER(Stiegrojums!G19),Stiegrojums!E19,\"\")","v":""},{"$f":"IF(ISNUMBER(Stiegrojums!G19),Stiegrojums!G19,\"\")","v":""},{"$f":"IF(ISNUMBER(Stiegrojums!G19),Stiegrojums!H19,\"\")","v":""},{"$f":"IF(ISTEXT(Stiegrojums!I19),Stiegrojums!I19,\"\")","v":""},""]
[{"$f":"IF(ISNUMBER(Stiegrojums!G20),Stiegrojums!A20,\"\")","v":""},{"$f":"IF(ISNUMBER(Stiegrojums!G20),Stiegrojums!B20,\"\")","v":""},{"$f":"IF(ISNUMBER(Stiegrojums!G20),Stiegrojums!C20,\"\")","v":""},{"$f":"IF(ISNUMBER(Stiegrojums!G20),Stiegrojums!E20,\"\")","v":""},{"$f":"IF(ISNUMBER(Stiegrojums!G20),Stiegrojums!G20,\"\")","v":""},{"$f":"IF(ISNUMBER(Stiegrojums!G20),Stiegrojums!H20,\"\")","v":""},{"$f":"IF(ISTEXT(Stiegrojums!I20),Stiegrojums!I20,\"\")","v":""},""]
[{"$f":"IF(ISNUMBER(Stiegrojums!G21),Stiegrojums!A21,\"\")","v":""},{"$f":"IF(ISNUMBER(Stiegrojums!G21),Stiegrojums!B21,\"\")","v":""},{"$f":"IF(ISNUMBER(Stiegrojums!G21),Stiegrojums!C21,\"\")","v":""},{"$f":"IF(ISNUMBER(Stiegrojums!G21),Stiegrojums!E21,\"\")","v":""},{"$f":"IF(ISNUMBER(Stiegrojums!G21),Stiegrojums!G21,\"\")","v":""},{"$f":"IF(ISNUMBER(Stiegrojums!G21),Stiegrojums!H21,\"\")","v":""},{"$f":"IF(ISTEXT(Stiegrojums!I21),Stiegrojums!I21,\"\")","v":""},""]
[{"$f":"IF(ISNUMBER(Stiegrojums!G22),Stiegrojums!A22,\"\")","v":""},{"$f":"IF(ISNUMBER(Stiegrojums!G22),Stiegrojums!B22,\"\")","v":""},{"$f":"IF(ISNUMBER(Stiegrojums!G22),Stiegrojums!C22,\"\")","v":""},{"$f":"IF(ISNUMBER(Stiegrojums!G22),Stiegrojums!E22,\"\")","v":""},{"$f":"IF(ISNUMBER(Stiegrojums!G22),Stiegrojums!G22,\"\")","v":""},{"$f":"IF(ISNUMBER(Stiegrojums!G22),Stiegrojums!H22,\"\")","v":""},{"$f":"IF(ISTEXT(Stiegrojums!I22),Stiegrojums!I22,\"\")","v":""},""]
[{"$f":"IF(ISNUMBER(Stiegrojums!G23),Stiegrojums!A23,\"\")","v":""},{"$f":"IF(ISNUMBER(Stiegrojums!G23),Stiegrojums!B23,\"\")","v":""},{"$f":"IF(ISNUMBER(Stiegrojums!G23),Stiegrojums!C23,\"\")","v":""},{"$f":"IF(ISNUMBER(Stiegrojums!G23),Stiegrojums!E23,\"\")","v":""},{"$f":"IF(ISNUMBER(Stiegrojums!G23),Stiegrojums!G23,\"\")","v":""},{"$f":"IF(ISNUMBER(Stiegrojums!G23),Stiegrojums!H23,\"\")","v":""},{"$f":"IF(ISTEXT(Stiegrojums!I23),Stiegrojums!I23,\"\")","v":""},""]
[{"$f":"IF(ISNUMBER(Stiegrojums!G24),Stiegrojums!A24,\"\")","v":""},{"$f":"IF(ISNUMBER(Stiegrojums!G24),Stiegrojums!B24,\"\")","v":""},{"$f":"IF(ISNUMBER(Stiegrojums!G24),Stiegrojums!C24,\"\")","v":""},{"$f":"IF(ISNUMBER(Stiegrojums!G24),Stiegrojums!E24,\"\")","v":""},{"$f":"IF(ISNUMBER(Stiegrojums!G24),Stiegrojums!G24,\"\")","v":""},{"$f":"IF(ISNUMBER(Stiegrojums!G24),Stiegrojums!H24,\"\")","v":""},{"$f":"IF(ISTEXT(Stiegrojums!I24),Stiegrojums!I24,\"\")","v":""},""]
[{"$f":"IF(ISNUMBER(Stiegrojums!G25),Stiegrojums!A25,\"\")","v":""},{"$f":"IF(ISNUMBER(Stiegrojums!G25),Stiegrojums!B25,\"\")","v":""},{"$f":"IF(ISNUMBER(Stiegrojums!G25),Stiegrojums!C25,\"\")","v":""},{"$f":"IF(ISNUMBER(Stiegrojums!G25),Stiegrojums!E25,\"\")","v":""},{"$f":"IF(ISNUMBER(Stiegrojums!G25),Stiegrojums!G25,\"\")","v":""},{"$f":"IF(ISNUMBER(Stiegrojums!G25),Stiegrojums!H25,\"\")","v":""},{"$f":"IF(ISTEXT(Stiegrojums!I25),Stiegrojums!I25,\"\")","v":""},""]
[{"$f":"IF(ISNUMBER(Stiegrojums!G26),Stiegrojums!A26,\"\")","v":""},{"$f":"IF(ISNUMBER(Stiegrojums!G26),Stiegrojums!B26,\"\")","v":""},{"$f":"IF(ISNUMBER(Stiegrojums!G26),Stiegrojums!C26,\"\")","v":""},{"$f":"IF(ISNUMBER(Stiegrojums!G26),Stiegrojums!E26,\"\")","v":""},{"$f":"IF(ISNUMBER(Stiegrojums!G26),Stiegrojums!G26,\"\")","v":""},{"$f":"IF(ISNUMBER(Stiegrojums!G26),Stiegrojums!H26,\"\")","v":""},{"$f":"IF(ISTEXT(Stiegrojums!I26),Stiegrojums!I26,\"\")","v":""},""]
[{"$f":"IF(ISNUMBER(Stiegrojums!G27),Stiegrojums!A27,\"\")","v":""},{"$f":"IF(ISNUMBER(Stiegrojums!G27),Stiegrojums!B27,\"\")","v":""},{"$f":"IF(ISNUMBER(Stiegrojums!G27),Stiegrojums!C27,\"\")","v":""},{"$f":"IF(ISNUMBER(Stiegrojums!G27),Stiegrojums!E27,\"\")","v":""},{"$f":"IF(ISNUMBER(Stiegrojums!G27),Stiegrojums!G27,\"\")","v":""},{"$f":"IF(ISNUMBER(Stiegrojums!G27),Stiegrojums!H27,\"\")","v":""},{"$f":"IF(ISTEXT(Stiegrojums!I27),Stiegrojums!I27,\"\")","v":""},""]
[{"$f":"IF(ISNUMBER(Stiegrojums!G28),Stiegrojums!A28,\"\")","v":""},{"$f":"IF(ISNUMBER(Stiegrojums!G28),Stiegrojums!B28,\"\")","v":""},{"$f":"IF(ISNUMBER(Stiegrojums!G28),Stiegrojums!C28,\"\")","v":""},{"$f":"IF(ISNUMBER(Stiegrojums!G28),Stiegrojums!E28,\"\")","v":""},{"$f":"IF(ISNUMBER(Stiegrojums!G28),Stiegrojums!G28,\"\")","v":""},{"$f":"IF(ISNUMBER(Stiegrojums!G28),Stiegrojums!H28,\"\")","v":""},{"$f":"IF(ISTEXT(Stiegrojums!I28),Stiegrojums!I28,\"\")","v":""},""]
[{"$f":"IF(ISNUMBER(Stiegrojums!G29),Stiegrojums!A29,\"\")","v":""},{"$f":"IF(ISNUMBER(Stiegrojums!G29),Stiegrojums!B29,\"\")","v":""},{"$f":"IF(ISNUMBER(Stiegrojums!G29),Stiegrojums!C29,\"\")","v":""},{"$f":"IF(ISNUMBER(Stiegrojums!G29),Stiegrojums!E29,\"\")","v":""},{"$f":"IF(ISNUMBER(Stiegrojums!G29),Stiegrojums!G29,\"\")","v":""},{"$f":"IF(ISNUMBER(Stiegrojums!G29),Stiegrojums!H29,\"\")","v":""},{"$f":"IF(ISTEXT(Stiegrojums!I29),Stiegrojums!I29,\"\")","v":""},""]
[{"$f":"IF(ISNUMBER(Stiegrojums!G30),Stiegrojums!A30,\"\")","v":""},{"$f":"IF(ISNUMBER(Stiegrojums!G30),Stiegrojums!B30,\"\")","v":""},{"$f":"IF(ISNUMBER(Stiegrojums!G30),Stiegrojums!C30,\"\")","v":""},{"$f":"IF(ISNUMBER(Stiegrojums!G30),Stiegrojums!E30,\"\")","v":""},{"$f":"IF(ISNUMBER(Stiegrojums!G30),Stiegrojums!G30,\"\")","v":""},{"$f":"IF(ISNUMBER(Stiegrojums!G30),Stiegrojums!H30,\"\")","v":""},{"$f":"IF(ISTEXT(Stiegrojums!I30),Stiegrojums!I30,\"\")","v":""},""]
[{"$f":"IF(ISNUMBER(Stiegrojums!G31),Stiegrojums!A31,\"\")","v":""},{"$f":"IF(ISNUMBER(Stiegrojums!G31),Stiegrojums!B31,\"\")","v":""},{"$f":"IF(ISNUMBER(Stiegrojums!G31),Stiegrojums!C31,\"\")","v":""},{"$f":"IF(ISNUMBER(Stiegrojums!G31),Stiegrojums!E31,\"\")","v":""},{"$f":"IF(ISNUMBER(Stiegrojums!G31),Stiegrojums!G31,\"\")","v":""},{"$f":"IF(ISNUMBER(Stiegrojums!G31),Stiegrojums!H31,\"\")","v":""},{"$f":"IF(ISTEXT(Stiegrojums!I31),Stiegrojums!I31,\"\")","v":""},""]
[{"$f":"IF(ISNUMBER(Stiegrojums!G32),Stiegrojums!A32,\"\")","v":""},{"$f":"IF(ISNUMBER(Stiegrojums!G32),Stiegrojums!B32,\"\")","v":""},{"$f":"IF(ISNUMBER(Stiegrojums!G32),Stiegrojums!C32,\"\")","v":""},{"$f":"IF(ISNUMBER(Stiegrojums!G32),Stiegrojums!E32,\"\")","v":""},{"$f":"IF(ISNUMBER(Stiegrojums!G32),Stiegrojums!G32,\"\")","v":""},{"$f":"IF(ISNUMBER(Stiegrojums!G32),Stiegrojums!H32,\"\")","v":""},{"$f":"IF(ISTEXT(Stiegrojums!I32),Stiegrojums!I32,\"\")","v":""},""]
[{"$f":"IF(ISNUMBER(Stiegrojums!G33),Stiegrojums!A33,\"\")","v":""},{"$f":"IF(ISNUMBER(Stiegrojums!G33),Stiegrojums!B33,\"\")","v":""},{"$f":"IF(ISNUMBER(Stiegrojums!G33),Stiegrojums!C33,\"\")","v":""},{"$f":"IF(ISNUMBER(Stiegrojums!G33),Stiegrojums!E33,\"\")","v":""},{"$f":"IF(ISNUMBER(Stiegrojums!G33),Stiegrojums!G33,\"\")","v":""},{"$f":"IF(ISNUMBER(Stiegrojums!G33),Stiegrojums!H33,\"\")","v":""},{"$f":"IF(ISTEXT(Stiegrojums!I33),Stiegrojums!I33,\"\")","v":""},""]
[]
[]
[{"$f":"IF(ISNUMBER(Ķieģeļi!G4),Ķieģeļi!A4,\"\")","v":""},{"$f":"IF(ISNUMBER(Ķieģeļi!G4),Ķieģeļi!B4,\"\")","v":""},{"$f":"IF(ISNUMBER(Ķieģeļi!G4),Ķieģeļi!C4,\"\")","v":""},{"$f":"IF(ISNUMBER(Ķieģeļi!G4),Ķieģeļi!E4,\"\")","v":""},{"$f":"IF(ISNUMBER(Ķieģeļi!G4),Ķieģeļi!G4,\"\")","v":""},{"$f":"IF(ISNUMBER(Ķieģeļi!G4),Ķieģeļi!H4,\"\")","v":""},{"$f":"IF(ISTEXT(Ķieģeļi!I4),Ķieģeļi!I4,\"\")","v":""},{"$f":"IF(ISNUMBER(E443),\"yes\",\"\")","v":""}]
[{"$f":"IF(ISNUMBER(Ķieģeļi!G5),Ķieģeļi!A5,\"\")","v":""},{"$f":"IF(ISNUMBER(Ķieģeļi!G5),Ķieģeļi!B5,\"\")","v":""},{"$f":"IF(ISNUMBER(Ķieģeļi!G5),Ķieģeļi!C5,\"\")","v":""},{"$f":"IF(ISNUMBER(Ķieģeļi!G5),Ķieģeļi!E5,\"\")","v":""},{"$f":"IF(ISNUMBER(Ķieģeļi!G5),Ķieģeļi!G5,\"\")","v":""},{"$f":"IF(ISNUMBER(Ķieģeļi!G5),Ķieģeļi!H5,\"\")","v":""},{"$f":"IF(ISTEXT(Ķieģeļi!I5),Ķieģeļi!I5,\"\")","v":""},""]
[{"$f":"IF(ISNUMBER(Ķieģeļi!G6),Ķieģeļi!A6,\"\")","v":""},{"$f":"IF(ISNUMBER(Ķieģeļi!G6),Ķieģeļi!B6,\"\")","v":""},{"$f":"IF(ISNUMBER(Ķieģeļi!G6),Ķieģeļi!C6,\"\")","v":""},{"$f":"IF(ISNUMBER(Ķieģeļi!G6),Ķieģeļi!E6,\"\")","v":""},{"$f":"IF(ISNUMBER(Ķieģeļi!G6),Ķieģeļi!G6,\"\")","v":""},{"$f":"IF(ISNUMBER(Ķieģeļi!G6),Ķieģeļi!H6,\"\")","v":""},{"$f":"IF(ISTEXT(Ķieģeļi!I6),Ķieģeļi!I6,\"\")","v":""},""]
[{"$f":"IF(ISNUMBER(Ķieģeļi!G7),Ķieģeļi!A7,\"\")","v":""},{"$f":"IF(ISNUMBER(Ķieģeļi!G7),Ķieģeļi!B7,\"\")","v":""},{"$f":"IF(ISNUMBER(Ķieģeļi!G7),Ķieģeļi!C7,\"\")","v":""},{"$f":"IF(ISNUMBER(Ķieģeļi!G7),Ķieģeļi!E7,\"\")","v":""},{"$f":"IF(ISNUMBER(Ķieģeļi!G7),Ķieģeļi!G7,\"\")","v":""},{"$f":"IF(ISNUMBER(Ķieģeļi!G7),Ķieģeļi!H7,\"\")","v":""},{"$f":"IF(ISTEXT(Ķieģeļi!I7),Ķieģeļi!I7,\"\")","v":""},""]
[{"$f":"IF(ISNUMBER(Ķieģeļi!G8),Ķieģeļi!A8,\"\")","v":""},{"$f":"IF(ISNUMBER(Ķieģeļi!G8),Ķieģeļi!B8,\"\")","v":""},{"$f":"IF(ISNUMBER(Ķieģeļi!G8),Ķieģeļi!C8,\"\")","v":""},{"$f":"IF(ISNUMBER(Ķieģeļi!G8),Ķieģeļi!E8,\"\")","v":""},{"$f":"IF(ISNUMBER(Ķieģeļi!G8),Ķieģeļi!G8,\"\")","v":""},{"$f":"IF(ISNUMBER(Ķieģeļi!G8),Ķieģeļi!H8,\"\")","v":""},{"$f":"IF(ISTEXT(Ķieģeļi!I8),Ķieģeļi!I8,\"\")","v":""},""]
[{"$f":"IF(ISNUMBER(Ķieģeļi!G9),Ķieģeļi!A9,\"\")","v":""},{"$f":"IF(ISNUMBER(Ķieģeļi!G9),Ķieģeļi!B9,\"\")","v":""},{"$f":"IF(ISNUMBER(Ķieģeļi!G9),Ķieģeļi!C9,\"\")","v":""},{"$f":"IF(ISNUMBER(Ķieģeļi!G9),Ķieģeļi!E9,\"\")","v":""},{"$f":"IF(ISNUMBER(Ķieģeļi!G9),Ķieģeļi!G9,\"\")","v":""},{"$f":"IF(ISNUMBER(Ķieģeļi!G9),Ķieģeļi!H9,\"\")","v":""},{"$f":"IF(ISTEXT(Ķieģeļi!I9),Ķieģeļi!I9,\"\")","v":""},""]
[{"$f":"IF(ISNUMBER(Ķieģeļi!G10),Ķieģeļi!A10,\"\")","v":""},{"$f":"IF(ISNUMBER(Ķieģeļi!G10),Ķieģeļi!B10,\"\")","v":""},{"$f":"IF(ISNUMBER(Ķieģeļi!G10),Ķieģeļi!C10,\"\")","v":""},{"$f":"IF(ISNUMBER(Ķieģeļi!G10),Ķieģeļi!E10,\"\")","v":""},{"$f":"IF(ISNUMBER(Ķieģeļi!G10),Ķieģeļi!G10,\"\")","v":""},{"$f":"IF(ISNUMBER(Ķieģeļi!G10),Ķieģeļi!H10,\"\")","v":""},{"$f":"IF(ISTEXT(Ķieģeļi!I10),Ķieģeļi!I10,\"\")","v":""},""]
[{"$f":"IF(ISNUMBER(Ķieģeļi!G11),Ķieģeļi!A11,\"\")","v":""},{"$f":"IF(ISNUMBER(Ķieģeļi!G11),Ķieģeļi!B11,\"\")","v":""},{"$f":"IF(ISNUMBER(Ķieģeļi!G11),Ķieģeļi!C11,\"\")","v":""},{"$f":"IF(ISNUMBER(Ķieģeļi!G11),Ķieģeļi!E11,\"\")","v":""},{"$f":"IF(ISNUMBER(Ķieģeļi!G11),Ķieģeļi!G11,\"\")","v":""},{"$f":"IF(ISNUMBER(Ķieģeļi!G11),Ķieģeļi!H11,\"\")","v":""},{"$f":"IF(ISTEXT(Ķieģeļi!I11),Ķieģeļi!I11,\"\")","v":""},""]
[{"$f":"IF(ISNUMBER(Ķieģeļi!G12),Ķieģeļi!A12,\"\")","v":""},{"$f":"IF(ISNUMBER(Ķieģeļi!G12),Ķieģeļi!B12,\"\")","v":""},{"$f":"IF(ISNUMBER(Ķieģeļi!G12),Ķieģeļi!C12,\"\")","v":""},{"$f":"IF(ISNUMBER(Ķieģeļi!G12),Ķieģeļi!E12,\"\")","v":""},{"$f":"IF(ISNUMBER(Ķieģeļi!G12),Ķieģeļi!G12,\"\")","v":""},{"$f":"IF(ISNUMBER(Ķieģeļi!G12),Ķieģeļi!H12,\"\")","v":""},{"$f":"IF(ISTEXT(Ķieģeļi!I12),Ķieģeļi!I12,\"\")","v":""},""]
[{"$f":"IF(ISNUMBER(Ķieģeļi!G13),Ķieģeļi!A13,\"\")","v":""},{"$f":"IF(ISNUMBER(Ķieģeļi!G13),Ķieģeļi!B13,\"\")","v":""},{"$f":"IF(ISNUMBER(Ķieģeļi!G13),Ķieģeļi!C13,\"\")","v":""},{"$f":"IF(ISNUMBER(Ķieģeļi!G13),Ķieģeļi!E13,\"\")","v":""},{"$f":"IF(ISNUMBER(Ķieģeļi!G13),Ķieģeļi!G13,\"\")","v":""},{"$f":"IF(ISNUMBER(Ķieģeļi!G13),Ķieģeļi!H13,\"\")","v":""},{"$f":"IF(ISTEXT(Ķieģeļi!I13),Ķieģeļi!I13,\"\")","v":""},""]
[{"$f":"IF(ISNUMBER(Ķieģeļi!G14),Ķieģeļi!A14,\"\")","v":""},{"$f":"IF(ISNUMBER(Ķieģeļi!G14),Ķieģeļi!B14,\"\")","v":""},{"$f":"IF(ISNUMBER(Ķieģeļi!G14),Ķieģeļi!C14,\"\")","v":""},{"$f":"IF(ISNUMBER(Ķieģeļi!G14),Ķieģeļi!E14,\"\")","v":""},{"$f":"IF(ISNUMBER(Ķieģeļi!G14),Ķieģeļi!G14,\"\")","v":""},{"$f":"IF(ISNUMBER(Ķieģeļi!G14),Ķieģeļi!H14,\"\")","v":""},{"$f":"IF(ISTEXT(Ķieģeļi!I14),Ķieģeļi!I14,\"\")","v":""},""]
[{"$f":"IF(ISNUMBER(Ķieģeļi!G15),Ķieģeļi!A15,\"\")","v":""},{"$f":"IF(ISNUMBER(Ķieģeļi!G15),Ķieģeļi!B15,\"\")","v":""},{"$f":"IF(ISNUMBER(Ķieģeļi!G15),Ķieģeļi!C15,\"\")","v":""},{"$f":"IF(ISNUMBER(Ķieģeļi!G15),Ķieģeļi!E15,\"\")","v":""},{"$f":"IF(ISNUMBER(Ķieģeļi!G15),Ķieģeļi!G15,\"\")","v":""},{"$f":"IF(ISNUMBER(Ķieģeļi!G15),Ķieģeļi!H15,\"\")","v":""},{"$f":"IF(ISTEXT(Ķieģeļi!I15),Ķieģeļi!I15,\"\")","v":""},""]
[{"$f":"IF(ISNUMBER(Ķieģeļi!G16),Ķieģeļi!A16,\"\")","v":""},{"$f":"IF(ISNUMBER(Ķieģeļi!G16),Ķieģeļi!B16,\"\")","v":""},{"$f":"IF(ISNUMBER(Ķieģeļi!G16),Ķieģeļi!C16,\"\")","v":""},{"$f":"IF(ISNUMBER(Ķieģeļi!G16),Ķieģeļi!E16,\"\")","v":""},{"$f":"IF(ISNUMBER(Ķieģeļi!G16),Ķieģeļi!G16,\"\")","v":""},{"$f":"IF(ISNUMBER(Ķieģeļi!G16),Ķieģeļi!H16,\"\")","v":""},{"$f":"IF(ISTEXT(Ķieģeļi!I16),Ķieģeļi!I16,\"\")","v":""},""]
[{"$f":"IF(ISNUMBER(Ķieģeļi!G17),Ķieģeļi!A17,\"\")","v":""},{"$f":"IF(ISNUMBER(Ķieģeļi!G17),Ķieģeļi!B17,\"\")","v":""},{"$f":"IF(ISNUMBER(Ķieģeļi!G17),Ķieģeļi!C17,\"\")","v":""},{"$f":"IF(ISNUMBER(Ķieģeļi!G17),Ķieģeļi!E17,\"\")","v":""},{"$f":"IF(ISNUMBER(Ķieģeļi!G17),Ķieģeļi!G17,\"\")","v":""},{"$f":"IF(ISNUMBER(Ķieģeļi!G17),Ķieģeļi!H17,\"\")","v":""},{"$f":"IF(ISTEXT(Ķieģeļi!I17),Ķieģeļi!I17,\"\")","v":""},""]
[{"$f":"IF(ISNUMBER(Ķieģeļi!G18),Ķieģeļi!A18,\"\")","v":""},{"$f":"IF(ISNUMBER(Ķieģeļi!G18),Ķieģeļi!B18,\"\")","v":""},{"$f":"IF(ISNUMBER(Ķieģeļi!G18),Ķieģeļi!C18,\"\")","v":""},{"$f":"IF(ISNUMBER(Ķieģeļi!G18),Ķieģeļi!E18,\"\")","v":""},{"$f":"IF(ISNUMBER(Ķieģeļi!G18),Ķieģeļi!G18,\"\")","v":""},{"$f":"IF(ISNUMBER(Ķieģeļi!G18),Ķieģeļi!H18,\"\")","v":""},{"$f":"IF(ISTEXT(Ķieģeļi!I18),Ķieģeļi!I18,\"\")","v":""},""]
[{"$f":"IF(ISNUMBER(Ķieģeļi!G19),Ķieģeļi!A19,\"\")","v":""},{"$f":"IF(ISNUMBER(Ķieģeļi!G19),Ķieģeļi!B19,\"\")","v":""},{"$f":"IF(ISNUMBER(Ķieģeļi!G19),Ķieģeļi!C19,\"\")","v":""},{"$f":"IF(ISNUMBER(Ķieģeļi!G19),Ķieģeļi!E19,\"\")","v":""},{"$f":"IF(ISNUMBER(Ķieģeļi!G19),Ķieģeļi!G19,\"\")","v":""},{"$f":"IF(ISNUMBER(Ķieģeļi!G19),Ķieģeļi!H19,\"\")","v":""},{"$f":"IF(ISTEXT(Ķieģeļi!I19),Ķieģeļi!I19,\"\")","v":""},""]
[{"$f":"IF(ISNUMBER(Ķieģeļi!G20),Ķieģeļi!A20,\"\")","v":""},{"$f":"IF(ISNUMBER(Ķieģeļi!G20),Ķieģeļi!B20,\"\")","v":""},{"$f":"IF(ISNUMBER(Ķieģeļi!G20),Ķieģeļi!C20,\"\")","v":""},{"$f":"IF(ISNUMBER(Ķieģeļi!G20),Ķieģeļi!E20,\"\")","v":""},{"$f":"IF(ISNUMBER(Ķieģeļi!G20),Ķieģeļi!G20,\"\")","v":""},{"$f":"IF(ISNUMBER(Ķieģeļi!G20),Ķieģeļi!H20,\"\")","v":""},{"$f":"IF(ISTEXT(Ķieģeļi!I20),Ķieģeļi!I20,\"\")","v":""},""]
[{"$f":"IF(ISNUMBER(Ķieģeļi!G21),Ķieģeļi!A21,\"\")","v":""},{"$f":"IF(ISNUMBER(Ķieģeļi!G21),Ķieģeļi!B21,\"\")","v":""},{"$f":"IF(ISNUMBER(Ķieģeļi!G21),Ķieģeļi!C21,\"\")","v":""},{"$f":"IF(ISNUMBER(Ķieģeļi!G21),Ķieģeļi!E21,\"\")","v":""},{"$f":"IF(ISNUMBER(Ķieģeļi!G21),Ķieģeļi!G21,\"\")","v":""},{"$f":"IF(ISNUMBER(Ķieģeļi!G21),Ķieģeļi!H21,\"\")","v":""},{"$f":"IF(ISTEXT(Ķieģeļi!I21),Ķieģeļi!I21,\"\")","v":""},""]
[{"$f":"IF(ISNUMBER(Ķieģeļi!G22),Ķieģeļi!A22,\"\")","v":""},{"$f":"IF(ISNUMBER(Ķieģeļi!G22),Ķieģeļi!B22,\"\")","v":""},{"$f":"IF(ISNUMBER(Ķieģeļi!G22),Ķieģeļi!C22,\"\")","v":""},{"$f":"IF(ISNUMBER(Ķieģeļi!G22),Ķieģeļi!E22,\"\")","v":""},{"$f":"IF(ISNUMBER(Ķieģeļi!G22),Ķieģeļi!G22,\"\")","v":""},{"$f":"IF(ISNUMBER(Ķieģeļi!G22),Ķieģeļi!H22,\"\")","v":""},{"$f":"IF(ISTEXT(Ķieģeļi!I22),Ķieģeļi!I22,\"\")","v":""},""]
[{"$f":"IF(ISNUMBER(Ķieģeļi!G23),Ķieģeļi!A23,\"\")","v":""},{"$f":"IF(ISNUMBER(Ķieģeļi!G23),Ķieģeļi!B23,\"\")","v":""},{"$f":"IF(ISNUMBER(Ķieģeļi!G23),Ķieģeļi!C23,\"\")","v":""},{"$f":"IF(ISNUMBER(Ķieģeļi!G23),Ķieģeļi!E23,\"\")","v":""},{"$f":"IF(ISNUMBER(Ķieģeļi!G23),Ķieģeļi!G23,\"\")","v":""},{"$f":"IF(ISNUMBER(Ķieģeļi!G23),Ķieģeļi!H23,\"\")","v":""},{"$f":"IF(ISTEXT(Ķieģeļi!I23),Ķieģeļi!I23,\"\")","v":""},""]
[{"$f":"IF(ISNUMBER(Ķieģeļi!G24),Ķieģeļi!A24,\"\")","v":""},{"$f":"IF(ISNUMBER(Ķieģeļi!G24),Ķieģeļi!B24,\"\")","v":""},{"$f":"IF(ISNUMBER(Ķieģeļi!G24),Ķieģeļi!C24,\"\")","v":""},{"$f":"IF(ISNUMBER(Ķieģeļi!G24),Ķieģeļi!E24,\"\")","v":""},{"$f":"IF(ISNUMBER(Ķieģeļi!G24),Ķieģeļi!G24,\"\")","v":""},{"$f":"IF(ISNUMBER(Ķieģeļi!G24),Ķieģeļi!H24,\"\")","v":""},{"$f":"IF(ISTEXT(Ķieģeļi!I24),Ķieģeļi!I24,\"\")","v":""},""]
[{"$f":"IF(ISNUMBER(Ķieģeļi!G25),Ķieģeļi!A25,\"\")","v":""},{"$f":"IF(ISNUMBER(Ķieģeļi!G25),Ķieģeļi!B25,\"\")","v":""},{"$f":"IF(ISNUMBER(Ķieģeļi!G25),Ķieģeļi!C25,\"\")","v":""},{"$f":"IF(ISNUMBER(Ķieģeļi!G25),Ķieģeļi!E25,\"\")","v":""},{"$f":"IF(ISNUMBER(Ķieģeļi!G25),Ķieģeļi!G25,\"\")","v":""},{"$f":"IF(ISNUMBER(Ķieģeļi!G25),Ķieģeļi!H25,\"\")","v":""},{"$f":"IF(ISTEXT(Ķieģeļi!I25),Ķieģeļi!I25,\"\")","v":""},""]
[{"$f":"IF(ISNUMBER(Ķieģeļi!G26),Ķieģeļi!A26,\"\")","v":""},{"$f":"IF(ISNUMBER(Ķieģeļi!G26),Ķieģeļi!B26,\"\")","v":""},{"$f":"IF(ISNUMBER(Ķieģeļi!G26),Ķieģeļi!C26,\"\")","v":""},{"$f":"IF(ISNUMBER(Ķieģeļi!G26),Ķieģeļi!E26,\"\")","v":""},{"$f":"IF(ISNUMBER(Ķieģeļi!G26),Ķieģeļi!G26,\"\")","v":""},{"$f":"IF(ISNUMBER(Ķieģeļi!G26),Ķieģeļi!H26,\"\")","v":""},{"$f":"IF(ISTEXT(Ķieģeļi!I26),Ķieģeļi!I26,\"\")","v":""},""]
[{"$f":"IF(ISNUMBER(Ķieģeļi!G27),Ķieģeļi!A27,\"\")","v":""},{"$f":"IF(ISNUMBER(Ķieģeļi!G27),Ķieģeļi!B27,\"\")","v":""},{"$f":"IF(ISNUMBER(Ķieģeļi!G27),Ķieģeļi!C27,\"\")","v":""},{"$f":"IF(ISNUMBER(Ķieģeļi!G27),Ķieģeļi!E27,\"\")","v":""},{"$f":"IF(ISNUMBER(Ķieģeļi!G27),Ķieģeļi!G27,\"\")","v":""},{"$f":"IF(ISNUMBER(Ķieģeļi!G27),Ķieģeļi!H27,\"\")","v":""},{"$f":"IF(ISTEXT(Ķieģeļi!I27),Ķieģeļi!I27,\"\")","v":""},""]
[{"$f":"IF(ISNUMBER(Ķieģeļi!G28),Ķieģeļi!A28,\"\")","v":""},{"$f":"IF(ISNUMBER(Ķieģeļi!G28),Ķieģeļi!B28,\"\")","v":""},{"$f":"IF(ISNUMBER(Ķieģeļi!G28),Ķieģeļi!C28,\"\")","v":""},{"$f":"IF(ISNUMBER(Ķieģeļi!G28),Ķieģeļi!E28,\"\")","v":""},{"$f":"IF(ISNUMBER(Ķieģeļi!G28),Ķieģeļi!G28,\"\")","v":""},{"$f":"IF(ISNUMBER(Ķieģeļi!G28),Ķieģeļi!H28,\"\")","v":""},{"$f":"IF(ISTEXT(Ķieģeļi!I28),Ķieģeļi!I28,\"\")","v":""},""]
[{"$f":"IF(ISNUMBER(Ķieģeļi!G29),Ķieģeļi!A29,\"\")","v":""},{"$f":"IF(ISNUMBER(Ķieģeļi!G29),Ķieģeļi!B29,\"\")","v":""},{"$f":"IF(ISNUMBER(Ķieģeļi!G29),Ķieģeļi!C29,\"\")","v":""},{"$f":"IF(ISNUMBER(Ķieģeļi!G29),Ķieģeļi!E29,\"\")","v":""},{"$f":"IF(ISNUMBER(Ķieģeļi!G29),Ķieģeļi!G29,\"\")","v":""},{"$f":"IF(ISNUMBER(Ķieģeļi!G29),Ķieģeļi!H29,\"\")","v":""},{"$f":"IF(ISTEXT(Ķieģeļi!I29),Ķieģeļi!I29,\"\")","v":""},""]
[]
[]
[{"$f":"IF(ISNUMBER(Ruļmateriāli!G4),Ruļmateriāli!A4,\"\")","v":""},{"$f":"IF(ISNUMBER(Ruļmateriāli!G4),Ruļmateriāli!B4,\"\")","v":""},{"$f":"IF(ISNUMBER(Ruļmateriāli!G4),Ruļmateriāli!C4,\"\")","v":""},{"$f":"IF(ISNUMBER(Ruļmateriāli!G4),Ruļmateriāli!E4,\"\")","v":""},{"$f":"IF(ISNUMBER(Ruļmateriāli!G4),Ruļmateriāli!G4,\"\")","v":""},{"$f":"IF(ISNUMBER(Ruļmateriāli!G4),Ruļmateriāli!H4,\"\")","v":""},{"$f":"IF(ISTEXT(Ruļmateriāli!I4),Ruļmateriāli!I4,\"\")","v":""},{"$f":"IF(ISNUMBER(E471),\"yes\",\"\")","v":""}]
[{"$f":"IF(ISNUMBER(Ruļmateriāli!G5),Ruļmateriāli!A5,\"\")","v":""},{"$f":"IF(ISNUMBER(Ruļmateriāli!G5),Ruļmateriāli!B5,\"\")","v":""},{"$f":"IF(ISNUMBER(Ruļmateriāli!G5),Ruļmateriāli!C5,\"\")","v":""},{"$f":"IF(ISNUMBER(Ruļmateriāli!G5),Ruļmateriāli!E5,\"\")","v":""},{"$f":"IF(ISNUMBER(Ruļmateriāli!G5),Ruļmateriāli!G5,\"\")","v":""},{"$f":"IF(ISNUMBER(Ruļmateriāli!G5),Ruļmateriāli!H5,\"\")","v":""},{"$f":"IF(ISTEXT(Ruļmateriāli!I5),Ruļmateriāli!I5,\"\")","v":""},""]
[{"$f":"IF(ISNUMBER(Ruļmateriāli!G6),Ruļmateriāli!A6,\"\")","v":""},{"$f":"IF(ISNUMBER(Ruļmateriāli!G6),Ruļmateriāli!B6,\"\")","v":""},{"$f":"IF(ISNUMBER(Ruļmateriāli!G6),Ruļmateriāli!C6,\"\")","v":""},{"$f":"IF(ISNUMBER(Ruļmateriāli!G6),Ruļmateriāli!E6,\"\")","v":""},{"$f":"IF(ISNUMBER(Ruļmateriāli!G6),Ruļmateriāli!G6,\"\")","v":""},{"$f":"IF(ISNUMBER(Ruļmateriāli!G6),Ruļmateriāli!H6,\"\")","v":""},{"$f":"IF(ISTEXT(Ruļmateriāli!I6),Ruļmateriāli!I6,\"\")","v":""},""]
[{"$f":"IF(ISNUMBER(Ruļmateriāli!G7),Ruļmateriāli!A7,\"\")","v":""},{"$f":"IF(ISNUMBER(Ruļmateriāli!G7),Ruļmateriāli!B7,\"\")","v":""},{"$f":"IF(ISNUMBER(Ruļmateriāli!G7),Ruļmateriāli!C7,\"\")","v":""},{"$f":"IF(ISNUMBER(Ruļmateriāli!G7),Ruļmateriāli!E7,\"\")","v":""},{"$f":"IF(ISNUMBER(Ruļmateriāli!G7),Ruļmateriāli!G7,\"\")","v":""},{"$f":"IF(ISNUMBER(Ruļmateriāli!G7),Ruļmateriāli!H7,\"\")","v":""},{"$f":"IF(ISTEXT(Ruļmateriāli!I7),Ruļmateriāli!I7,\"\")","v":""},""]
[{"$f":"IF(ISNUMBER(Ruļmateriāli!G8),Ruļmateriāli!A8,\"\")","v":""},{"$f":"IF(ISNUMBER(Ruļmateriāli!G8),Ruļmateriāli!B8,\"\")","v":""},{"$f":"IF(ISNUMBER(Ruļmateriāli!G8),Ruļmateriāli!C8,\"\")","v":""},{"$f":"IF(ISNUMBER(Ruļmateriāli!G8),Ruļmateriāli!E8,\"\")","v":""},{"$f":"IF(ISNUMBER(Ruļmateriāli!G8),Ruļmateriāli!G8,\"\")","v":""},{"$f":"IF(ISNUMBER(Ruļmateriāli!G8),Ruļmateriāli!H8,\"\")","v":""},{"$f":"IF(ISTEXT(Ruļmateriāli!I8),Ruļmateriāli!I8,\"\")","v":""},""]
[{"$f":"IF(ISNUMBER(Ruļmateriāli!G9),Ruļmateriāli!A9,\"\")","v":""},{"$f":"IF(ISNUMBER(Ruļmateriāli!G9),Ruļmateriāli!B9,\"\")","v":""},{"$f":"IF(ISNUMBER(Ruļmateriāli!G9),Ruļmateriāli!C9,\"\")","v":""},{"$f":"IF(ISNUMBER(Ruļmateriāli!G9),Ruļmateriāli!E9,\"\")","v":""},{"$f":"IF(ISNUMBER(Ruļmateriāli!G9),Ruļmateriāli!G9,\"\")","v":""},{"$f":"IF(ISNUMBER(Ruļmateriāli!G9),Ruļmateriāli!H9,\"\")","v":""},{"$f":"IF(ISTEXT(Ruļmateriāli!I9),Ruļmateriāli!I9,\"\")","v":""},""]
[{"$f":"IF(ISNUMBER(Ruļmateriāli!G10),Ruļmateriāli!A10,\"\")","v":""},{"$f":"IF(ISNUMBER(Ruļmateriāli!G10),Ruļmateriāli!B10,\"\")","v":""},{"$f":"IF(ISNUMBER(Ruļmateriāli!G10),Ruļmateriāli!C10,\"\")","v":""},{"$f":"IF(ISNUMBER(Ruļmateriāli!G10),Ruļmateriāli!E10,\"\")","v":""},{"$f":"IF(ISNUMBER(Ruļmateriāli!G10),Ruļmateriāli!G10,\"\")","v":""},{"$f":"IF(ISNUMBER(Ruļmateriāli!G10),Ruļmateriāli!H10,\"\")","v":""},{"$f":"IF(ISTEXT(Ruļmateriāli!I10),Ruļmateriāli!I10,\"\")","v":""},""]
[{"$f":"IF(ISNUMBER(Ruļmateriāli!G11),Ruļmateriāli!A11,\"\")","v":""},{"$f":"IF(ISNUMBER(Ruļmateriāli!G11),Ruļmateriāli!B11,\"\")","v":""},{"$f":"IF(ISNUMBER(Ruļmateriāli!G11),Ruļmateriāli!C11,\"\")","v":""},{"$f":"IF(ISNUMBER(Ruļmateriāli!G11),Ruļmateriāli!E11,\"\")","v":""},{"$f":"IF(ISNUMBER(Ruļmateriāli!G11),Ruļmateriāli!G11,\"\")","v":""},{"$f":"IF(ISNUMBER(Ruļmateriāli!G11),Ruļmateriāli!H11,\"\")","v":""},{"$f":"IF(ISTEXT(Ruļmateriāli!I11),Ruļmateriāli!I11,\"\")","v":""},""]
[{"$f":"IF(ISNUMBER(Ruļmateriāli!G12),Ruļmateriāli!A12,\"\")","v":""},{"$f":"IF(ISNUMBER(Ruļmateriāli!G12),Ruļmateriāli!B12,\"\")","v":""},{"$f":"IF(ISNUMBER(Ruļmateriāli!G12),Ruļmateriāli!C12,\"\")","v":""},{"$f":"IF(ISNUMBER(Ruļmateriāli!G12),Ruļmateriāli!E12,\"\")","v":""},{"$f":"IF(ISNUMBER(Ruļmateriāli!G12),Ruļmateriāli!G12,\"\")","v":""},{"$f":"IF(ISNUMBER(Ruļmateriāli!G12),Ruļmateriāli!H12,\"\")","v":""},{"$f":"IF(ISTEXT(Ruļmateriāli!I12),Ruļmateriāli!I12,\"\")","v":""},""]
[{"$f":"IF(ISNUMBER(Ruļmateriāli!G13),Ruļmateriāli!A13,\"\")","v":""},{"$f":"IF(ISNUMBER(Ruļmateriāli!G13),Ruļmateriāli!B13,\"\")","v":""},{"$f":"IF(ISNUMBER(Ruļmateriāli!G13),Ruļmateriāli!C13,\"\")","v":""},{"$f":"IF(ISNUMBER(Ruļmateriāli!G13),Ruļmateriāli!E13,\"\")","v":""},{"$f":"IF(ISNUMBER(Ruļmateriāli!G13),Ruļmateriāli!G13,\"\")","v":""},{"$f":"IF(ISNUMBER(Ruļmateriāli!G13),Ruļmateriāli!H13,\"\")","v":""},{"$f":"IF(ISTEXT(Ruļmateriāli!I13),Ruļmateriāli!I13,\"\")","v":""},""]
[{"$f":"IF(ISNUMBER(Ruļmateriāli!G14),Ruļmateriāli!A14,\"\")","v":""},{"$f":"IF(ISNUMBER(Ruļmateriāli!G14),Ruļmateriāli!B14,\"\")","v":""},{"$f":"IF(ISNUMBER(Ruļmateriāli!G14),Ruļmateriāli!C14,\"\")","v":""},{"$f":"IF(ISNUMBER(Ruļmateriāli!G14),Ruļmateriāli!E14,\"\")","v":""},{"$f":"IF(ISNUMBER(Ruļmateriāli!G14),Ruļmateriāli!G14,\"\")","v":""},{"$f":"IF(ISNUMBER(Ruļmateriāli!G14),Ruļmateriāli!H14,\"\")","v":""},{"$f":"IF(ISTEXT(Ruļmateriāli!I14),Ruļmateriāli!I14,\"\")","v":""},""]
[{"$f":"IF(ISNUMBER(Ruļmateriāli!G15),Ruļmateriāli!A15,\"\")","v":""},{"$f":"IF(ISNUMBER(Ruļmateriāli!G15),Ruļmateriāli!B15,\"\")","v":""},{"$f":"IF(ISNUMBER(Ruļmateriāli!G15),Ruļmateriāli!C15,\"\")","v":""},{"$f":"IF(ISNUMBER(Ruļmateriāli!G15),Ruļmateriāli!E15,\"\")","v":""},{"$f":"IF(ISNUMBER(Ruļmateriāli!G15),Ruļmateriāli!G15,\"\")","v":""},{"$f":"IF(ISNUMBER(Ruļmateriāli!G15),Ruļmateriāli!H15,\"\")","v":""},{"$f":"IF(ISTEXT(Ruļmateriāli!I15),Ruļmateriāli!I15,\"\")","v":""},""]
[{"$f":"IF(ISNUMBER(Ruļmateriāli!G16),Ruļmateriāli!A16,\"\")","v":""},{"$f":"IF(ISNUMBER(Ruļmateriāli!G16),Ruļmateriāli!B16,\"\")","v":""},{"$f":"IF(ISNUMBER(Ruļmateriāli!G16),Ruļmateriāli!C16,\"\")","v":""},{"$f":"IF(ISNUMBER(Ruļmateriāli!G16),Ruļmateriāli!E16,\"\")","v":""},{"$f":"IF(ISNUMBER(Ruļmateriāli!G16),Ruļmateriāli!G16,\"\")","v":""},{"$f":"IF(ISNUMBER(Ruļmateriāli!G16),Ruļmateriāli!H16,\"\")","v":""},{"$f":"IF(ISTEXT(Ruļmateriāli!I16),Ruļmateriāli!I16,\"\")","v":""},""]
[{"$f":"IF(ISNUMBER(Ruļmateriāli!G17),Ruļmateriāli!A17,\"\")","v":""},{"$f":"IF(ISNUMBER(Ruļmateriāli!G17),Ruļmateriāli!B17,\"\")","v":""},{"$f":"IF(ISNUMBER(Ruļmateriāli!G17),Ruļmateriāli!C17,\"\")","v":""},{"$f":"IF(ISNUMBER(Ruļmateriāli!G17),Ruļmateriāli!E17,\"\")","v":""},{"$f":"IF(ISNUMBER(Ruļmateriāli!G17),Ruļmateriāli!G17,\"\")","v":""},{"$f":"IF(ISNUMBER(Ruļmateriāli!G17),Ruļmateriāli!H17,\"\")","v":""},{"$f":"IF(ISTEXT(Ruļmateriāli!I17),Ruļmateriāli!I17,\"\")","v":""},""]
[{"$f":"IF(ISNUMBER(Ruļmateriāli!G18),Ruļmateriāli!A18,\"\")","v":""},{"$f":"IF(ISNUMBER(Ruļmateriāli!G18),Ruļmateriāli!B18,\"\")","v":""},{"$f":"IF(ISNUMBER(Ruļmateriāli!G18),Ruļmateriāli!C18,\"\")","v":""},{"$f":"IF(ISNUMBER(Ruļmateriāli!G18),Ruļmateriāli!E18,\"\")","v":""},{"$f":"IF(ISNUMBER(Ruļmateriāli!G18),Ruļmateriāli!G18,\"\")","v":""},{"$f":"IF(ISNUMBER(Ruļmateriāli!G18),Ruļmateriāli!H18,\"\")","v":""},{"$f":"IF(ISTEXT(Ruļmateriāli!I18),Ruļmateriāli!I18,\"\")","v":""},""]
[{"$f":"IF(ISNUMBER(Ruļmateriāli!G19),Ruļmateriāli!A19,\"\")","v":""},{"$f":"IF(ISNUMBER(Ruļmateriāli!G19),Ruļmateriāli!B19,\"\")","v":""},{"$f":"IF(ISNUMBER(Ruļmateriāli!G19),Ruļmateriāli!C19,\"\")","v":""},{"$f":"IF(ISNUMBER(Ruļmateriāli!G19),Ruļmateriāli!E19,\"\")","v":""},{"$f":"IF(ISNUMBER(Ruļmateriāli!G19),Ruļmateriāli!G19,\"\")","v":""},{"$f":"IF(ISNUMBER(Ruļmateriāli!G19),Ruļmateriāli!H19,\"\")","v":""},{"$f":"IF(ISTEXT(Ruļmateriāli!I19),Ruļmateriāli!I19,\"\")","v":""},""]
[{"$f":"IF(ISNUMBER(Ruļmateriāli!G20),Ruļmateriāli!A20,\"\")","v":""},{"$f":"IF(ISNUMBER(Ruļmateriāli!G20),Ruļmateriāli!B20,\"\")","v":""},{"$f":"IF(ISNUMBER(Ruļmateriāli!G20),Ruļmateriāli!C20,\"\")","v":""},{"$f":"IF(ISNUMBER(Ruļmateriāli!G20),Ruļmateriāli!E20,\"\")","v":""},{"$f":"IF(ISNUMBER(Ruļmateriāli!G20),Ruļmateriāli!G20,\"\")","v":""},{"$f":"IF(ISNUMBER(Ruļmateriāli!G20),Ruļmateriāli!H20,\"\")","v":""},{"$f":"IF(ISTEXT(Ruļmateriāli!I20),Ruļmateriāli!I20,\"\")","v":""},""]
[{"$f":"IF(ISNUMBER(Ruļmateriāli!G21),Ruļmateriāli!A21,\"\")","v":""},{"$f":"IF(ISNUMBER(Ruļmateriāli!G21),Ruļmateriāli!B21,\"\")","v":""},{"$f":"IF(ISNUMBER(Ruļmateriāli!G21),Ruļmateriāli!C21,\"\")","v":""},{"$f":"IF(ISNUMBER(Ruļmateriāli!G21),Ruļmateriāli!E21,\"\")","v":""},{"$f":"IF(ISNUMBER(Ruļmateriāli!G21),Ruļmateriāli!G21,\"\")","v":""},{"$f":"IF(ISNUMBER(Ruļmateriāli!G21),Ruļmateriāli!H21,\"\")","v":""},{"$f":"IF(ISTEXT(Ruļmateriāli!I21),Ruļmateriāli!I21,\"\")","v":""},""]
[{"$f":"IF(ISNUMBER(Ruļmateriāli!G22),Ruļmateriāli!A22,\"\")","v":""},{"$f":"IF(ISNUMBER(Ruļmateriāli!G22),Ruļmateriāli!B22,\"\")","v":""},{"$f":"IF(ISNUMBER(Ruļmateriāli!G22),Ruļmateriāli!C22,\"\")","v":""},{"$f":"IF(ISNUMBER(Ruļmateriāli!G22),Ruļmateriāli!E22,\"\")","v":""},{"$f":"IF(ISNUMBER(Ruļmateriāli!G22),Ruļmateriāli!G22,\"\")","v":""},{"$f":"IF(ISNUMBER(Ruļmateriāli!G22),Ruļmateriāli!H22,\"\")","v":""},{"$f":"IF(ISTEXT(Ruļmateriāli!I22),Ruļmateriāli!I22,\"\")","v":""},""]
[{"$f":"IF(ISNUMBER(Ruļmateriāli!G23),Ruļmateriāli!A23,\"\")","v":""},{"$f":"IF(ISNUMBER(Ruļmateriāli!G23),Ruļmateriāli!B23,\"\")","v":""},{"$f":"IF(ISNUMBER(Ruļmateriāli!G23),Ruļmateriāli!C23,\"\")","v":""},{"$f":"IF(ISNUMBER(Ruļmateriāli!G23),Ruļmateriāli!E23,\"\")","v":""},{"$f":"IF(ISNUMBER(Ruļmateriāli!G23),Ruļmateriāli!G23,\"\")","v":""},{"$f":"IF(ISNUMBER(Ruļmateriāli!G23),Ruļmateriāli!H23,\"\")","v":""},{"$f":"IF(ISTEXT(Ruļmateriāli!I23),Ruļmateriāli!I23,\"\")","v":""},""]
[{"$f":"IF(ISNUMBER(Ruļmateriāli!G24),Ruļmateriāli!A24,\"\")","v":""},{"$f":"IF(ISNUMBER(Ruļmateriāli!G24),Ruļmateriāli!B24,\"\")","v":""},{"$f":"IF(ISNUMBER(Ruļmateriāli!G24),Ruļmateriāli!C24,\"\")","v":""},{"$f":"IF(ISNUMBER(Ruļmateriāli!G24),Ruļmateriāli!E24,\"\")","v":""},{"$f":"IF(ISNUMBER(Ruļmateriāli!G24),Ruļmateriāli!G24,\"\")","v":""},{"$f":"IF(ISNUMBER(Ruļmateriāli!G24),Ruļmateriāli!H24,\"\")","v":""},{"$f":"IF(ISTEXT(Ruļmateriāli!I24),Ruļmateriāli!I24,\"\")","v":""},""]
[{"$f":"IF(ISNUMBER(Ruļmateriāli!G25),Ruļmateriāli!A25,\"\")","v":""},{"$f":"IF(ISNUMBER(Ruļmateriāli!G25),Ruļmateriāli!B25,\"\")","v":""},{"$f":"IF(ISNUMBER(Ruļmateriāli!G25),Ruļmateriāli!C25,\"\")","v":""},{"$f":"IF(ISNUMBER(Ruļmateriāli!G25),Ruļmateriāli!E25,\"\")","v":""},{"$f":"IF(ISNUMBER(Ruļmateriāli!G25),Ruļmateriāli!G25,\"\")","v":""},{"$f":"IF(ISNUMBER(Ruļmateriāli!G25),Ruļmateriāli!H25,\"\")","v":""},{"$f":"IF(ISTEXT(Ruļmateriāli!I25),Ruļmateriāli!I25,\"\")","v":""},""]
[{"$f":"IF(ISNUMBER(Ruļmateriāli!G26),Ruļmateriāli!A26,\"\")","v":""},{"$f":"IF(ISNUMBER(Ruļmateriāli!G26),Ruļmateriāli!B26,\"\")","v":""},{"$f":"IF(ISNUMBER(Ruļmateriāli!G26),Ruļmateriāli!C26,\"\")","v":""},{"$f":"IF(ISNUMBER(Ruļmateriāli!G26),Ruļmateriāli!E26,\"\")","v":""},{"$f":"IF(ISNUMBER(Ruļmateriāli!G26),Ruļmateriāli!G26,\"\")","v":""},{"$f":"IF(ISNUMBER(Ruļmateriāli!G26),Ruļmateriāli!H26,\"\")","v":""},{"$f":"IF(ISTEXT(Ruļmateriāli!I26),Ruļmateriāli!I26,\"\")","v":""},""]
[{"$f":"IF(ISNUMBER(Ruļmateriāli!G27),Ruļmateriāli!A27,\"\")","v":""},{"$f":"IF(ISNUMBER(Ruļmateriāli!G27),Ruļmateriāli!B27,\"\")","v":""},{"$f":"IF(ISNUMBER(Ruļmateriāli!G27),Ruļmateriāli!C27,\"\")","v":""},{"$f":"IF(ISNUMBER(Ruļmateriāli!G27),Ruļmateriāli!E27,\"\")","v":""},{"$f":"IF(ISNUMBER(Ruļmateriāli!G27),Ruļmateriāli!G27,\"\")","v":""},{"$f":"IF(ISNUMBER(Ruļmateriāli!G27),Ruļmateriāli!H27,\"\")","v":""},{"$f":"IF(ISTEXT(Ruļmateriāli!I27),Ruļmateriāli!I27,\"\")","v":""},""]
[{"$f":"IF(ISNUMBER(Ruļmateriāli!G28),Ruļmateriāli!A28,\"\")","v":""},{"$f":"IF(ISNUMBER(Ruļmateriāli!G28),Ruļmateriāli!B28,\"\")","v":""},{"$f":"IF(ISNUMBER(Ruļmateriāli!G28),Ruļmateriāli!C28,\"\")","v":""},{"$f":"IF(ISNUMBER(Ruļmateriāli!G28),Ruļmateriāli!E28,\"\")","v":""},{"$f":"IF(ISNUMBER(Ruļmateriāli!G28),Ruļmateriāli!G28,\"\")","v":""},{"$f":"IF(ISNUMBER(Ruļmateriāli!G28),Ruļmateriāli!H28,\"\")","v":""},{"$f":"IF(ISTEXT(Ruļmateriāli!I28),Ruļmateriāli!I28,\"\")","v":""},""]
[{"$f":"IF(ISNUMBER(Ruļmateriāli!G29),Ruļmateriāli!A29,\"\")","v":""},{"$f":"IF(ISNUMBER(Ruļmateriāli!G29),Ruļmateriāli!B29,\"\")","v":""},{"$f":"IF(ISNUMBER(Ruļmateriāli!G29),Ruļmateriāli!C29,\"\")","v":""},{"$f":"IF(ISNUMBER(Ruļmateriāli!G29),Ruļmateriāli!E29,\"\")","v":""},{"$f":"IF(ISNUMBER(Ruļmateriāli!G29),Ruļmateriāli!G29,\"\")","v":""},{"$f":"IF(ISNUMBER(Ruļmateriāli!G29),Ruļmateriāli!H29,\"\")","v":""},{"$f":"IF(ISTEXT(Ruļmateriāli!I29),Ruļmateriāli!I29,\"\")","v":""},""]
[{"$f":"IF(ISNUMBER(Ruļmateriāli!G30),Ruļmateriāli!A30,\"\")","v":""},{"$f":"IF(ISNUMBER(Ruļmateriāli!G30),Ruļmateriāli!B30,\"\")","v":""},{"$f":"IF(ISNUMBER(Ruļmateriāli!G30),Ruļmateriāli!C30,\"\")","v":""},{"$f":"IF(ISNUMBER(Ruļmateriāli!G30),Ruļmateriāli!E30,\"\")","v":""},{"$f":"IF(ISNUMBER(Ruļmateriāli!G30),Ruļmateriāli!G30,\"\")","v":""},{"$f":"IF(ISNUMBER(Ruļmateriāli!G30),Ruļmateriāli!H30,\"\")","v":""},{"$f":"IF(ISTEXT(Ruļmateriāli!I30),Ruļmateriāli!I30,\"\")","v":""},""]
[{"$f":"IF(ISNUMBER(Ruļmateriāli!G31),Ruļmateriāli!A31,\"\")","v":""},{"$f":"IF(ISNUMBER(Ruļmateriāli!G31),Ruļmateriāli!B31,\"\")","v":""},{"$f":"IF(ISNUMBER(Ruļmateriāli!G31),Ruļmateriāli!C31,\"\")","v":""},{"$f":"IF(ISNUMBER(Ruļmateriāli!G31),Ruļmateriāli!E31,\"\")","v":""},{"$f":"IF(ISNUMBER(Ruļmateriāli!G31),Ruļmateriāli!G31,\"\")","v":""},{"$f":"IF(ISNUMBER(Ruļmateriāli!G31),Ruļmateriāli!H31,\"\")","v":""},{"$f":"IF(ISTEXT(Ruļmateriāli!I31),Ruļmateriāli!I31,\"\")","v":""},""]
[{"$f":"IF(ISNUMBER(Ruļmateriāli!G32),Ruļmateriāli!A32,\"\")","v":""},{"$f":"IF(ISNUMBER(Ruļmateriāli!G32),Ruļmateriāli!B32,\"\")","v":""},{"$f":"IF(ISNUMBER(Ruļmateriāli!G32),Ruļmateriāli!C32,\"\")","v":""},{"$f":"IF(ISNUMBER(Ruļmateriāli!G32),Ruļmateriāli!E32,\"\")","v":""},{"$f":"IF(ISNUMBER(Ruļmateriāli!G32),Ruļmateriāli!G32,\"\")","v":""},{"$f":"IF(ISNUMBER(Ruļmateriāli!G32),Ruļmateriāli!H32,\"\")","v":""},{"$f":"IF(ISTEXT(Ruļmateriāli!I32),Ruļmateriāli!I32,\"\")","v":""},""]
[{"$f":"IF(ISNUMBER(Ruļmateriāli!G33),Ruļmateriāli!A33,\"\")","v":""},{"$f":"IF(ISNUMBER(Ruļmateriāli!G33),Ruļmateriāli!B33,\"\")","v":""},{"$f":"IF(ISNUMBER(Ruļmateriāli!G33),Ruļmateriāli!C33,\"\")","v":""},{"$f":"IF(ISNUMBER(Ruļmateriāli!G33),Ruļmateriāli!E33,\"\")","v":""},{"$f":"IF(ISNUMBER(Ruļmateriāli!G33),Ruļmateriāli!G33,\"\")","v":""},{"$f":"IF(ISNUMBER(Ruļmateriāli!G33),Ruļmateriāli!H33,\"\")","v":""},{"$f":"IF(ISTEXT(Ruļmateriāli!I33),Ruļmateriāli!I33,\"\")","v":""},""]
[{"$f":"IF(ISNUMBER(Ruļmateriāli!G34),Ruļmateriāli!A34,\"\")","v":""},{"$f":"IF(ISNUMBER(Ruļmateriāli!G34),Ruļmateriāli!B34,\"\")","v":""},{"$f":"IF(ISNUMBER(Ruļmateriāli!G34),Ruļmateriāli!C34,\"\")","v":""},{"$f":"IF(ISNUMBER(Ruļmateriāli!G34),Ruļmateriāli!E34,\"\")","v":""},{"$f":"IF(ISNUMBER(Ruļmateriāli!G34),Ruļmateriāli!G34,\"\")","v":""},{"$f":"IF(ISNUMBER(Ruļmateriāli!G34),Ruļmateriāli!H34,\"\")","v":""},{"$f":"IF(ISTEXT(Ruļmateriāli!I34),Ruļmateriāli!I34,\"\")","v":""},""]
[{"$f":"IF(ISNUMBER(Ruļmateriāli!G35),Ruļmateriāli!A35,\"\")","v":""},{"$f":"IF(ISNUMBER(Ruļmateriāli!G35),Ruļmateriāli!B35,\"\")","v":""},{"$f":"IF(ISNUMBER(Ruļmateriāli!G35),Ruļmateriāli!C35,\"\")","v":""},{"$f":"IF(ISNUMBER(Ruļmateriāli!G35),Ruļmateriāli!E35,\"\")","v":""},{"$f":"IF(ISNUMBER(Ruļmateriāli!G35),Ruļmateriāli!G35,\"\")","v":""},{"$f":"IF(ISNUMBER(Ruļmateriāli!G35),Ruļmateriāli!H35,\"\")","v":""},{"$f":"IF(ISTEXT(Ruļmateriāli!I35),Ruļmateriāli!I35,\"\")","v":""},""]
[{"$f":"IF(ISNUMBER(Ruļmateriāli!G36),Ruļmateriāli!A36,\"\")","v":""},{"$f":"IF(ISNUMBER(Ruļmateriāli!G36),Ruļmateriāli!B36,\"\")","v":""},{"$f":"IF(ISNUMBER(Ruļmateriāli!G36),Ruļmateriāli!C36,\"\")","v":""},{"$f":"IF(ISNUMBER(Ruļmateriāli!G36),Ruļmateriāli!E36,\"\")","v":""},{"$f":"IF(ISNUMBER(Ruļmateriāli!G36),Ruļmateriāli!G36,\"\")","v":""},{"$f":"IF(ISNUMBER(Ruļmateriāli!G36),Ruļmateriāli!H36,\"\")","v":""},{"$f":"IF(ISTEXT(Ruļmateriāli!I36),Ruļmateriāli!I36,\"\")","v":""},""]
[{"$f":"IF(ISNUMBER(Ruļmateriāli!G37),Ruļmateriāli!A37,\"\")","v":""},{"$f":"IF(ISNUMBER(Ruļmateriāli!G37),Ruļmateriāli!B37,\"\")","v":""},{"$f":"IF(ISNUMBER(Ruļmateriāli!G37),Ruļmateriāli!C37,\"\")","v":""},{"$f":"IF(ISNUMBER(Ruļmateriāli!G37),Ruļmateriāli!E37,\"\")","v":""},{"$f":"IF(ISNUMBER(Ruļmateriāli!G37),Ruļmateriāli!G37,\"\")","v":""},{"$f":"IF(ISNUMBER(Ruļmateriāli!G37),Ruļmateriāli!H37,\"\")","v":""},{"$f":"IF(ISTEXT(Ruļmateriāli!I37),Ruļmateriāli!I37,\"\")","v":""},""]
[{"$f":"IF(ISNUMBER(Ruļmateriāli!G38),Ruļmateriāli!A38,\"\")","v":""},{"$f":"IF(ISNUMBER(Ruļmateriāli!G38),Ruļmateriāli!B38,\"\")","v":""},{"$f":"IF(ISNUMBER(Ruļmateriāli!G38),Ruļmateriāli!C38,\"\")","v":""},{"$f":"IF(ISNUMBER(Ruļmateriāli!G38),Ruļmateriāli!E38,\"\")","v":""},{"$f":"IF(ISNUMBER(Ruļmateriāli!G38),Ruļmateriāli!G38,\"\")","v":""},{"$f":"IF(ISNUMBER(Ruļmateriāli!G38),Ruļmateriāli!H38,\"\")","v":""},{"$f":"IF(ISTEXT(Ruļmateriāli!I38),Ruļmateriāli!I38,\"\")","v":""},""]
[{"$f":"IF(ISNUMBER(Ruļmateriāli!G39),Ruļmateriāli!A39,\"\")","v":""},{"$f":"IF(ISNUMBER(Ruļmateriāli!G39),Ruļmateriāli!B39,\"\")","v":""},{"$f":"IF(ISNUMBER(Ruļmateriāli!G39),Ruļmateriāli!C39,\"\")","v":""},{"$f":"IF(ISNUMBER(Ruļmateriāli!G39),Ruļmateriāli!E39,\"\")","v":""},{"$f":"IF(ISNUMBER(Ruļmateriāli!G39),Ruļmateriāli!G39,\"\")","v":""},{"$f":"IF(ISNUMBER(Ruļmateriāli!G39),Ruļmateriāli!H39,\"\")","v":""},{"$f":"IF(ISTEXT(Ruļmateriāli!I39),Ruļmateriāli!I39,\"\")","v":""},""]
[{"$f":"IF(ISNUMBER(Ruļmateriāli!G40),Ruļmateriāli!A40,\"\")","v":""},{"$f":"IF(ISNUMBER(Ruļmateriāli!G40),Ruļmateriāli!B40,\"\")","v":""},{"$f":"IF(ISNUMBER(Ruļmateriāli!G40),Ruļmateriāli!C40,\"\")","v":""},{"$f":"IF(ISNUMBER(Ruļmateriāli!G40),Ruļmateriāli!E40,\"\")","v":""},{"$f":"IF(ISNUMBER(Ruļmateriāli!G40),Ruļmateriāli!G40,\"\")","v":""},{"$f":"IF(ISNUMBER(Ruļmateriāli!G40),Ruļmateriāli!H40,\"\")","v":""},{"$f":"IF(ISTEXT(Ruļmateriāli!I40),Ruļmateriāli!I40,\"\")","v":""},""]
[{"$f":"IF(ISNUMBER(Ruļmateriāli!G41),Ruļmateriāli!A41,\"\")","v":""},{"$f":"IF(ISNUMBER(Ruļmateriāli!G41),Ruļmateriāli!B41,\"\")","v":""},{"$f":"IF(ISNUMBER(Ruļmateriāli!G41),Ruļmateriāli!C41,\"\")","v":""},{"$f":"IF(ISNUMBER(Ruļmateriāli!G41),Ruļmateriāli!E41,\"\")","v":""},{"$f":"IF(ISNUMBER(Ruļmateriāli!G41),Ruļmateriāli!G41,\"\")","v":""},{"$f":"IF(ISNUMBER(Ruļmateriāli!G41),Ruļmateriāli!H41,\"\")","v":""},{"$f":"IF(ISTEXT(Ruļmateriāli!I41),Ruļmateriāli!I41,\"\")","v":""},""]
[{"$f":"IF(ISNUMBER(Ruļmateriāli!G42),Ruļmateriāli!A42,\"\")","v":""},{"$f":"IF(ISNUMBER(Ruļmateriāli!G42),Ruļmateriāli!B42,\"\")","v":""},{"$f":"IF(ISNUMBER(Ruļmateriāli!G42),Ruļmateriāli!C42,\"\")","v":""},{"$f":"IF(ISNUMBER(Ruļmateriāli!G42),Ruļmateriāli!E42,\"\")","v":""},{"$f":"IF(ISNUMBER(Ruļmateriāli!G42),Ruļmateriāli!G42,\"\")","v":""},{"$f":"IF(ISNUMBER(Ruļmateriāli!G42),Ruļmateriāli!H42,\"\")","v":""},{"$f":"IF(ISTEXT(Ruļmateriāli!I42),Ruļmateriāli!I42,\"\")","v":""},""]
[{"$f":"IF(ISNUMBER(Ruļmateriāli!G43),Ruļmateriāli!A43,\"\")","v":""},{"$f":"IF(ISNUMBER(Ruļmateriāli!G43),Ruļmateriāli!B43,\"\")","v":""},{"$f":"IF(ISNUMBER(Ruļmateriāli!G43),Ruļmateriāli!C43,\"\")","v":""},{"$f":"IF(ISNUMBER(Ruļmateriāli!G43),Ruļmateriāli!E43,\"\")","v":""},{"$f":"IF(ISNUMBER(Ruļmateriāli!G43),Ruļmateriāli!G43,\"\")","v":""},{"$f":"IF(ISNUMBER(Ruļmateriāli!G43),Ruļmateriāli!H43,\"\")","v":""},{"$f":"IF(ISTEXT(Ruļmateriāli!I43),Ruļmateriāli!I43,\"\")","v":""},""]
[{"$f":"IF(ISNUMBER(Ruļmateriāli!G44),Ruļmateriāli!A44,\"\")","v":""},{"$f":"IF(ISNUMBER(Ruļmateriāli!G44),Ruļmateriāli!B44,\"\")","v":""},{"$f":"IF(ISNUMBER(Ruļmateriāli!G44),Ruļmateriāli!C44,\"\")","v":""},{"$f":"IF(ISNUMBER(Ruļmateriāli!G44),Ruļmateriāli!E44,\"\")","v":""},{"$f":"IF(ISNUMBER(Ruļmateriāli!G44),Ruļmateriāli!G44,\"\")","v":""},{"$f":"IF(ISNUMBER(Ruļmateriāli!G44),Ruļmateriāli!H44,\"\")","v":""},{"$f":"IF(ISTEXT(Ruļmateriāli!I44),Ruļmateriāli!I44,\"\")","v":""},""]
[{"$f":"IF(ISNUMBER(Ruļmateriāli!G45),Ruļmateriāli!A45,\"\")","v":""},{"$f":"IF(ISNUMBER(Ruļmateriāli!G45),Ruļmateriāli!B45,\"\")","v":""},{"$f":"IF(ISNUMBER(Ruļmateriāli!G45),Ruļmateriāli!C45,\"\")","v":""},{"$f":"IF(ISNUMBER(Ruļmateriāli!G45),Ruļmateriāli!E45,\"\")","v":""},{"$f":"IF(ISNUMBER(Ruļmateriāli!G45),Ruļmateriāli!G45,\"\")","v":""},{"$f":"IF(ISNUMBER(Ruļmateriāli!G45),Ruļmateriāli!H45,\"\")","v":""},{"$f":"IF(ISTEXT(Ruļmateriāli!I45),Ruļmateriāli!I45,\"\")","v":""},""]
[{"$f":"IF(ISNUMBER(Ruļmateriāli!G46),Ruļmateriāli!A46,\"\")","v":""},{"$f":"IF(ISNUMBER(Ruļmateriāli!G46),Ruļmateriāli!B46,\"\")","v":""},{"$f":"IF(ISNUMBER(Ruļmateriāli!G46),Ruļmateriāli!C46,\"\")","v":""},{"$f":"IF(ISNUMBER(Ruļmateriāli!G46),Ruļmateriāli!E46,\"\")","v":""},{"$f":"IF(ISNUMBER(Ruļmateriāli!G46),Ruļmateriāli!G46,\"\")","v":""},{"$f":"IF(ISNUMBER(Ruļmateriāli!G46),Ruļmateriāli!H46,\"\")","v":""},{"$f":"IF(ISTEXT(Ruļmateriāli!I46),Ruļmateriāli!I46,\"\")","v":""},""]
[{"$f":"IF(ISNUMBER(Ruļmateriāli!G47),Ruļmateriāli!A47,\"\")","v":""},{"$f":"IF(ISNUMBER(Ruļmateriāli!G47),Ruļmateriāli!B47,\"\")","v":""},{"$f":"IF(ISNUMBER(Ruļmateriāli!G47),Ruļmateriāli!C47,\"\")","v":""},{"$f":"IF(ISNUMBER(Ruļmateriāli!G47),Ruļmateriāli!E47,\"\")","v":""},{"$f":"IF(ISNUMBER(Ruļmateriāli!G47),Ruļmateriāli!G47,\"\")","v":""},{"$f":"IF(ISNUMBER(Ruļmateriāli!G47),Ruļmateriāli!H47,\"\")","v":""},{"$f":"IF(ISTEXT(Ruļmateriāli!I47),Ruļmateriāli!I47,\"\")","v":""},""]
[{"$f":"IF(ISNUMBER(Ruļmateriāli!G48),Ruļmateriāli!A48,\"\")","v":""},{"$f":"IF(ISNUMBER(Ruļmateriāli!G48),Ruļmateriāli!B48,\"\")","v":""},{"$f":"IF(ISNUMBER(Ruļmateriāli!G48),Ruļmateriāli!C48,\"\")","v":""},{"$f":"IF(ISNUMBER(Ruļmateriāli!G48),Ruļmateriāli!E48,\"\")","v":""},{"$f":"IF(ISNUMBER(Ruļmateriāli!G48),Ruļmateriāli!G48,\"\")","v":""},{"$f":"IF(ISNUMBER(Ruļmateriāli!G48),Ruļmateriāli!H48,\"\")","v":""},{"$f":"IF(ISTEXT(Ruļmateriāli!I48),Ruļmateriāli!I48,\"\")","v":""},""]
[{"$f":"IF(ISNUMBER(Ruļmateriāli!G49),Ruļmateriāli!A49,\"\")","v":""},{"$f":"IF(ISNUMBER(Ruļmateriāli!G49),Ruļmateriāli!B49,\"\")","v":""},{"$f":"IF(ISNUMBER(Ruļmateriāli!G49),Ruļmateriāli!C49,\"\")","v":""},{"$f":"IF(ISNUMBER(Ruļmateriāli!G49),Ruļmateriāli!E49,\"\")","v":""},{"$f":"IF(ISNUMBER(Ruļmateriāli!G49),Ruļmateriāli!G49,\"\")","v":""},{"$f":"IF(ISNUMBER(Ruļmateriāli!G49),Ruļmateriāli!H49,\"\")","v":""},{"$f":"IF(ISTEXT(Ruļmateriāli!I49),Ruļmateriāli!I49,\"\")","v":""},""]
[{"$f":"IF(ISNUMBER(Ruļmateriāli!G50),Ruļmateriāli!A50,\"\")","v":""},{"$f":"IF(ISNUMBER(Ruļmateriāli!G50),Ruļmateriāli!B50,\"\")","v":""},{"$f":"IF(ISNUMBER(Ruļmateriāli!G50),Ruļmateriāli!C50,\"\")","v":""},{"$f":"IF(ISNUMBER(Ruļmateriāli!G50),Ruļmateriāli!E50,\"\")","v":""},{"$f":"IF(ISNUMBER(Ruļmateriāli!G50),Ruļmateriāli!G50,\"\")","v":""},{"$f":"IF(ISNUMBER(Ruļmateriāli!G50),Ruļmateriāli!H50,\"\")","v":""},{"$f":"IF(ISTEXT(Ruļmateriāli!I50),Ruļmateriāli!I50,\"\")","v":""},""]
[{"$f":"IF(ISNUMBER(Ruļmateriāli!G51),Ruļmateriāli!A51,\"\")","v":""},{"$f":"IF(ISNUMBER(Ruļmateriāli!G51),Ruļmateriāli!B51,\"\")","v":""},{"$f":"IF(ISNUMBER(Ruļmateriāli!G51),Ruļmateriāli!C51,\"\")","v":""},{"$f":"IF(ISNUMBER(Ruļmateriāli!G51),Ruļmateriāli!E51,\"\")","v":""},{"$f":"IF(ISNUMBER(Ruļmateriāli!G51),Ruļmateriāli!G51,\"\")","v":""},{"$f":"IF(ISNUMBER(Ruļmateriāli!G51),Ruļmateriāli!H51,\"\")","v":""},{"$f":"IF(ISTEXT(Ruļmateriāli!I51),Ruļmateriāli!I51,\"\")","v":""},""]
[{"$f":"IF(ISNUMBER(Ruļmateriāli!G52),Ruļmateriāli!A52,\"\")","v":""},{"$f":"IF(ISNUMBER(Ruļmateriāli!G52),Ruļmateriāli!B52,\"\")","v":""},{"$f":"IF(ISNUMBER(Ruļmateriāli!G52),Ruļmateriāli!C52,\"\")","v":""},{"$f":"IF(ISNUMBER(Ruļmateriāli!G52),Ruļmateriāli!E52,\"\")","v":""},{"$f":"IF(ISNUMBER(Ruļmateriāli!G52),Ruļmateriāli!G52,\"\")","v":""},{"$f":"IF(ISNUMBER(Ruļmateriāli!G52),Ruļmateriāli!H52,\"\")","v":""},{"$f":"IF(ISTEXT(Ruļmateriāli!I52),Ruļmateriāli!I52,\"\")","v":""},""]
[{"$f":"IF(ISNUMBER(Ruļmateriāli!G53),Ruļmateriāli!A53,\"\")","v":""},{"$f":"IF(ISNUMBER(Ruļmateriāli!G53),Ruļmateriāli!B53,\"\")","v":""},{"$f":"IF(ISNUMBER(Ruļmateriāli!G53),Ruļmateriāli!C53,\"\")","v":""},{"$f":"IF(ISNUMBER(Ruļmateriāli!G53),Ruļmateriāli!E53,\"\")","v":""},{"$f":"IF(ISNUMBER(Ruļmateriāli!G53),Ruļmateriāli!G53,\"\")","v":""},{"$f":"IF(ISNUMBER(Ruļmateriāli!G53),Ruļmateriāli!H53,\"\")","v":""},{"$f":"IF(ISTEXT(Ruļmateriāli!I53),Ruļmateriāli!I53,\"\")","v":""},""]
[]
[]
[{"$f":"IF(ISNUMBER('Hidroizolācijas mat.'!G4),'Hidroizolācijas mat.'!A4,\"\")","v":""},{"$f":"IF(ISNUMBER('Hidroizolācijas mat.'!G4),'Hidroizolācijas mat.'!B4,\"\")","v":""},{"$f":"IF(ISNUMBER('Hidroizolācijas mat.'!G4),'Hidroizolācijas mat.'!C4,\"\")","v":""},{"$f":"IF(ISNUMBER('Hidroizolācijas mat.'!G4),'Hidroizolācijas mat.'!E4,\"\")","v":""},{"$f":"IF(ISNUMBER('Hidroizolācijas mat.'!G4),'Hidroizolācijas mat.'!G4,\"\")","v":""},{"$f":"IF(ISNUMBER('Hidroizolācijas mat.'!G4),'Hidroizolācijas mat.'!H4,\"\")","v":""},{"$f":"IF(ISTEXT('Hidroizolācijas mat.'!I4),'Hidroizolācijas mat.'!I4,\"\")","v":"Patēriņš 2,00 kg/m²"},{"$f":"IF(ISNUMBER(E523),\"yes\",\"\")","v":""}]
[{"$f":"IF(ISNUMBER('Hidroizolācijas mat.'!G5),'Hidroizolācijas mat.'!A5,\"\")","v":""},{"$f":"IF(ISNUMBER('Hidroizolācijas mat.'!G5),'Hidroizolācijas mat.'!B5,\"\")","v":""},{"$f":"IF(ISNUMBER('Hidroizolācijas mat.'!G5),'Hidroizolācijas mat.'!C5,\"\")","v":""},{"$f":"IF(ISNUMBER('Hidroizolācijas mat.'!G5),'Hidroizolācijas mat.'!E5,\"\")","v":""},{"$f":"IF(ISNUMBER('Hidroizolācijas mat.'!G5),'Hidroizolācijas mat.'!G5,\"\")","v":""},{"$f":"IF(ISNUMBER('Hidroizolācijas mat.'!G5),'Hidroizolācijas mat.'!H5,\"\")","v":""},{"$f":"IF(ISTEXT('Hidroizolācijas mat.'!I5),'Hidroizolācijas mat.'!I5,\"\")","v":"Patēriņš 1,00 kg/m²"},""]
[{"$f":"IF(ISNUMBER('Hidroizolācijas mat.'!G6),'Hidroizolācijas mat.'!A6,\"\")","v":""},{"$f":"IF(ISNUMBER('Hidroizolācijas mat.'!G6),'Hidroizolācijas mat.'!B6,\"\")","v":""},{"$f":"IF(ISNUMBER('Hidroizolācijas mat.'!G6),'Hidroizolācijas mat.'!C6,\"\")","v":""},{"$f":"IF(ISNUMBER('Hidroizolācijas mat.'!G6),'Hidroizolācijas mat.'!E6,\"\")","v":""},{"$f":"IF(ISNUMBER('Hidroizolācijas mat.'!G6),'Hidroizolācijas mat.'!G6,\"\")","v":""},{"$f":"IF(ISNUMBER('Hidroizolācijas mat.'!G6),'Hidroizolācijas mat.'!H6,\"\")","v":""},{"$f":"IF(ISTEXT('Hidroizolācijas mat.'!I6),'Hidroizolācijas mat.'!I6,\"\")","v":"Patēriņš 1,00 kg/m²"},""]
[{"$f":"IF(ISNUMBER('Hidroizolācijas mat.'!G7),'Hidroizolācijas mat.'!A7,\"\")","v":""},{"$f":"IF(ISNUMBER('Hidroizolācijas mat.'!G7),'Hidroizolācijas mat.'!B7,\"\")","v":""},{"$f":"IF(ISNUMBER('Hidroizolācijas mat.'!G7),'Hidroizolācijas mat.'!C7,\"\")","v":""},{"$f":"IF(ISNUMBER('Hidroizolācijas mat.'!G7),'Hidroizolācijas mat.'!E7,\"\")","v":""},{"$f":"IF(ISNUMBER('Hidroizolācijas mat.'!G7),'Hidroizolācijas mat.'!G7,\"\")","v":""},{"$f":"IF(ISNUMBER('Hidroizolācijas mat.'!G7),'Hidroizolācijas mat.'!H7,\"\")","v":""},{"$f":"IF(ISTEXT('Hidroizolācijas mat.'!I7),'Hidroizolācijas mat.'!I7,\"\")","v":"Patēriņš 1,33 kg/m²"},""]
[{"$f":"IF(ISNUMBER('Hidroizolācijas mat.'!G8),'Hidroizolācijas mat.'!A8,\"\")","v":""},{"$f":"IF(ISNUMBER('Hidroizolācijas mat.'!G8),'Hidroizolācijas mat.'!B8,\"\")","v":""},{"$f":"IF(ISNUMBER('Hidroizolācijas mat.'!G8),'Hidroizolācijas mat.'!C8,\"\")","v":""},{"$f":"IF(ISNUMBER('Hidroizolācijas mat.'!G8),'Hidroizolācijas mat.'!E8,\"\")","v":""},{"$f":"IF(ISNUMBER('Hidroizolācijas mat.'!G8),'Hidroizolācijas mat.'!G8,\"\")","v":""},{"$f":"IF(ISNUMBER('Hidroizolācijas mat.'!G8),'Hidroizolācijas mat.'!H8,\"\")","v":""},{"$f":"IF(ISTEXT('Hidroizolācijas mat.'!I8),'Hidroizolācijas mat.'!I8,\"\")","v":"Patēriņš 1,50 kg/m²"},""]
[{"$f":"IF(ISNUMBER('Hidroizolācijas mat.'!G9),'Hidroizolācijas mat.'!A9,\"\")","v":""},{"$f":"IF(ISNUMBER('Hidroizolācijas mat.'!G9),'Hidroizolācijas mat.'!B9,\"\")","v":""},{"$f":"IF(ISNUMBER('Hidroizolācijas mat.'!G9),'Hidroizolācijas mat.'!C9,\"\")","v":""},{"$f":"IF(ISNUMBER('Hidroizolācijas mat.'!G9),'Hidroizolācijas mat.'!E9,\"\")","v":""},{"$f":"IF(ISNUMBER('Hidroizolācijas mat.'!G9),'Hidroizolācijas mat.'!G9,\"\")","v":""},{"$f":"IF(ISNUMBER('Hidroizolācijas mat.'!G9),'Hidroizolācijas mat.'!H9,\"\")","v":""},{"$f":"IF(ISTEXT('Hidroizolācijas mat.'!I9),'Hidroizolācijas mat.'!I9,\"\")","v":"Patēriņš 1,20 kg/m²"},""]
[{"$f":"IF(ISNUMBER('Hidroizolācijas mat.'!G10),'Hidroizolācijas mat.'!A10,\"\")","v":""},{"$f":"IF(ISNUMBER('Hidroizolācijas mat.'!G10),'Hidroizolācijas mat.'!B10,\"\")","v":""},{"$f":"IF(ISNUMBER('Hidroizolācijas mat.'!G10),'Hidroizolācijas mat.'!C10,\"\")","v":""},{"$f":"IF(ISNUMBER('Hidroizolācijas mat.'!G10),'Hidroizolācijas mat.'!E10,\"\")","v":""},{"$f":"IF(ISNUMBER('Hidroizolācijas mat.'!G10),'Hidroizolācijas mat.'!G10,\"\")","v":""},{"$f":"IF(ISNUMBER('Hidroizolācijas mat.'!G10),'Hidroizolācijas mat.'!H10,\"\")","v":""},{"$f":"IF(ISTEXT('Hidroizolācijas mat.'!I10),'Hidroizolācijas mat.'!I10,\"\")","v":"Patēriņš 1,40 kg/m²"},""]
[{"$f":"IF(ISNUMBER('Hidroizolācijas mat.'!G11),'Hidroizolācijas mat.'!A11,\"\")","v":""},{"$f":"IF(ISNUMBER('Hidroizolācijas mat.'!G11),'Hidroizolācijas mat.'!B11,\"\")","v":""},{"$f":"IF(ISNUMBER('Hidroizolācijas mat.'!G11),'Hidroizolācijas mat.'!C11,\"\")","v":""},{"$f":"IF(ISNUMBER('Hidroizolācijas mat.'!G11),'Hidroizolācijas mat.'!E11,\"\")","v":""},{"$f":"IF(ISNUMBER('Hidroizolācijas mat.'!G11),'Hidroizolācijas mat.'!G11,\"\")","v":""},{"$f":"IF(ISNUMBER('Hidroizolācijas mat.'!G11),'Hidroizolācijas mat.'!H11,\"\")","v":""},{"$f":"IF(ISTEXT('Hidroizolācijas mat.'!I11),'Hidroizolācijas mat.'!I11,\"\")","v":"Patēriņš 1,40 kg/m²"},""]
[{"$f":"IF(ISNUMBER('Hidroizolācijas mat.'!G12),'Hidroizolācijas mat.'!A12,\"\")","v":""},{"$f":"IF(ISNUMBER('Hidroizolācijas mat.'!G12),'Hidroizolācijas mat.'!B12,\"\")","v":""},{"$f":"IF(ISNUMBER('Hidroizolācijas mat.'!G12),'Hidroizolācijas mat.'!C12,\"\")","v":""},{"$f":"IF(ISNUMBER('Hidroizolācijas mat.'!G12),'Hidroizolācijas mat.'!E12,\"\")","v":""},{"$f":"IF(ISNUMBER('Hidroizolācijas mat.'!G12),'Hidroizolācijas mat.'!G12,\"\")","v":""},{"$f":"IF(ISNUMBER('Hidroizolācijas mat.'!G12),'Hidroizolācijas mat.'!H12,\"\")","v":""},{"$f":"IF(ISTEXT('Hidroizolācijas mat.'!I12),'Hidroizolācijas mat.'!I12,\"\")","v":""},""]
[{"$f":"IF(ISNUMBER('Hidroizolācijas mat.'!G13),'Hidroizolācijas mat.'!A13,\"\")","v":""},{"$f":"IF(ISNUMBER('Hidroizolācijas mat.'!G13),'Hidroizolācijas mat.'!B13,\"\")","v":""},{"$f":"IF(ISNUMBER('Hidroizolācijas mat.'!G13),'Hidroizolācijas mat.'!C13,\"\")","v":""},{"$f":"IF(ISNUMBER('Hidroizolācijas mat.'!G13),'Hidroizolācijas mat.'!E13,\"\")","v":""},{"$f":"IF(ISNUMBER('Hidroizolācijas mat.'!G13),'Hidroizolācijas mat.'!G13,\"\")","v":""},{"$f":"IF(ISNUMBER('Hidroizolācijas mat.'!G13),'Hidroizolācijas mat.'!H13,\"\")","v":""},{"$f":"IF(ISTEXT('Hidroizolācijas mat.'!I13),'Hidroizolācijas mat.'!I13,\"\")","v":""},""]
[{"$f":"IF(ISNUMBER('Hidroizolācijas mat.'!G14),'Hidroizolācijas mat.'!A14,\"\")","v":""},{"$f":"IF(ISNUMBER('Hidroizolācijas mat.'!G14),'Hidroizolācijas mat.'!B14,\"\")","v":""},{"$f":"IF(ISNUMBER('Hidroizolācijas mat.'!G14),'Hidroizolācijas mat.'!C14,\"\")","v":""},{"$f":"IF(ISNUMBER('Hidroizolācijas mat.'!G14),'Hidroizolācijas mat.'!E14,\"\")","v":""},{"$f":"IF(ISNUMBER('Hidroizolācijas mat.'!G14),'Hidroizolācijas mat.'!G14,\"\")","v":""},{"$f":"IF(ISNUMBER('Hidroizolācijas mat.'!G14),'Hidroizolācijas mat.'!H14,\"\")","v":""},{"$f":"IF(ISTEXT('Hidroizolācijas mat.'!I14),'Hidroizolācijas mat.'!I14,\"\")","v":""},""]
[{"$f":"IF(ISNUMBER('Hidroizolācijas mat.'!G15),'Hidroizolācijas mat.'!A15,\"\")","v":""},{"$f":"IF(ISNUMBER('Hidroizolācijas mat.'!G15),'Hidroizolācijas mat.'!B15,\"\")","v":""},{"$f":"IF(ISNUMBER('Hidroizolācijas mat.'!G15),'Hidroizolācijas mat.'!C15,\"\")","v":""},{"$f":"IF(ISNUMBER('Hidroizolācijas mat.'!G15),'Hidroizolācijas mat.'!E15,\"\")","v":""},{"$f":"IF(ISNUMBER('Hidroizolācijas mat.'!G15),'Hidroizolācijas mat.'!G15,\"\")","v":""},{"$f":"IF(ISNUMBER('Hidroizolācijas mat.'!G15),'Hidroizolācijas mat.'!H15,\"\")","v":""},{"$f":"IF(ISTEXT('Hidroizolācijas mat.'!I15),'Hidroizolācijas mat.'!I15,\"\")","v":""},""]
[{"$f":"IF(ISNUMBER('Hidroizolācijas mat.'!G16),'Hidroizolācijas mat.'!A16,\"\")","v":""},{"$f":"IF(ISNUMBER('Hidroizolācijas mat.'!G16),'Hidroizolācijas mat.'!B16,\"\")","v":""},{"$f":"IF(ISNUMBER('Hidroizolācijas mat.'!G16),'Hidroizolācijas mat.'!C16,\"\")","v":""},{"$f":"IF(ISNUMBER('Hidroizolācijas mat.'!G16),'Hidroizolācijas mat.'!E16,\"\")","v":""},{"$f":"IF(ISNUMBER('Hidroizolācijas mat.'!G16),'Hidroizolācijas mat.'!G16,\"\")","v":""},{"$f":"IF(ISNUMBER('Hidroizolācijas mat.'!G16),'Hidroizolācijas mat.'!H16,\"\")","v":""},{"$f":"IF(ISTEXT('Hidroizolācijas mat.'!I16),'Hidroizolācijas mat.'!I16,\"\")","v":""},""]
[{"$f":"IF(ISNUMBER('Hidroizolācijas mat.'!G17),'Hidroizolācijas mat.'!A17,\"\")","v":""},{"$f":"IF(ISNUMBER('Hidroizolācijas mat.'!G17),'Hidroizolācijas mat.'!B17,\"\")","v":""},{"$f":"IF(ISNUMBER('Hidroizolācijas mat.'!G17),'Hidroizolācijas mat.'!C17,\"\")","v":""},{"$f":"IF(ISNUMBER('Hidroizolācijas mat.'!G17),'Hidroizolācijas mat.'!E17,\"\")","v":""},{"$f":"IF(ISNUMBER('Hidroizolācijas mat.'!G17),'Hidroizolācijas mat.'!G17,\"\")","v":""},{"$f":"IF(ISNUMBER('Hidroizolācijas mat.'!G17),'Hidroizolācijas mat.'!H17,\"\")","v":""},{"$f":"IF(ISTEXT('Hidroizolācijas mat.'!I17),'Hidroizolācijas mat.'!I17,\"\")","v":""},""]
[{"$f":"IF(ISNUMBER('Hidroizolācijas mat.'!G18),'Hidroizolācijas mat.'!A18,\"\")","v":""},{"$f":"IF(ISNUMBER('Hidroizolācijas mat.'!G18),'Hidroizolācijas mat.'!B18,\"\")","v":""},{"$f":"IF(ISNUMBER('Hidroizolācijas mat.'!G18),'Hidroizolācijas mat.'!C18,\"\")","v":""},{"$f":"IF(ISNUMBER('Hidroizolācijas mat.'!G18),'Hidroizolācijas mat.'!E18,\"\")","v":""},{"$f":"IF(ISNUMBER('Hidroizolācijas mat.'!G18),'Hidroizolācijas mat.'!G18,\"\")","v":""},{"$f":"IF(ISNUMBER('Hidroizolācijas mat.'!G18),'Hidroizolācijas mat.'!H18,\"\")","v":""},{"$f":"IF(ISTEXT('Hidroizolācijas mat.'!I18),'Hidroizolācijas mat.'!I18,\"\")","v":""},""]
[{"$f":"IF(ISNUMBER('Hidroizolācijas mat.'!G19),'Hidroizolācijas mat.'!A19,\"\")","v":""},{"$f":"IF(ISNUMBER('Hidroizolācijas mat.'!G19),'Hidroizolācijas mat.'!B19,\"\")","v":""},{"$f":"IF(ISNUMBER('Hidroizolācijas mat.'!G19),'Hidroizolācijas mat.'!C19,\"\")","v":""},{"$f":"IF(ISNUMBER('Hidroizolācijas mat.'!G19),'Hidroizolācijas mat.'!E19,\"\")","v":""},{"$f":"IF(ISNUMBER('Hidroizolācijas mat.'!G19),'Hidroizolācijas mat.'!G19,\"\")","v":""},{"$f":"IF(ISNUMBER('Hidroizolācijas mat.'!G19),'Hidroizolācijas mat.'!H19,\"\")","v":""},{"$f":"IF(ISTEXT('Hidroizolācijas mat.'!I19),'Hidroizolācijas mat.'!I19,\"\")","v":""},""]
[{"$f":"IF(ISNUMBER('Hidroizolācijas mat.'!G20),'Hidroizolācijas mat.'!A20,\"\")","v":""},{"$f":"IF(ISNUMBER('Hidroizolācijas mat.'!G20),'Hidroizolācijas mat.'!B20,\"\")","v":""},{"$f":"IF(ISNUMBER('Hidroizolācijas mat.'!G20),'Hidroizolācijas mat.'!C20,\"\")","v":""},{"$f":"IF(ISNUMBER('Hidroizolācijas mat.'!G20),'Hidroizolācijas mat.'!E20,\"\")","v":""},{"$f":"IF(ISNUMBER('Hidroizolācijas mat.'!G20),'Hidroizolācijas mat.'!G20,\"\")","v":""},{"$f":"IF(ISNUMBER('Hidroizolācijas mat.'!G20),'Hidroizolācijas mat.'!H20,\"\")","v":""},{"$f":"IF(ISTEXT('Hidroizolācijas mat.'!I20),'Hidroizolācijas mat.'!I20,\"\")","v":""},""]
[{"$f":"IF(ISNUMBER('Hidroizolācijas mat.'!G21),'Hidroizolācijas mat.'!A21,\"\")","v":""},{"$f":"IF(ISNUMBER('Hidroizolācijas mat.'!G21),'Hidroizolācijas mat.'!B21,\"\")","v":""},{"$f":"IF(ISNUMBER('Hidroizolācijas mat.'!G21),'Hidroizolācijas mat.'!C21,\"\")","v":""},{"$f":"IF(ISNUMBER('Hidroizolācijas mat.'!G21),'Hidroizolācijas mat.'!E21,\"\")","v":""},{"$f":"IF(ISNUMBER('Hidroizolācijas mat.'!G21),'Hidroizolācijas mat.'!G21,\"\")","v":""},{"$f":"IF(ISNUMBER('Hidroizolācijas mat.'!G21),'Hidroizolācijas mat.'!H21,\"\")","v":""},{"$f":"IF(ISTEXT('Hidroizolācijas mat.'!I21),'Hidroizolācijas mat.'!I21,\"\")","v":""},""]
[{"$f":"IF(ISNUMBER('Hidroizolācijas mat.'!G22),'Hidroizolācijas mat.'!A22,\"\")","v":""},{"$f":"IF(ISNUMBER('Hidroizolācijas mat.'!G22),'Hidroizolācijas mat.'!B22,\"\")","v":""},{"$f":"IF(ISNUMBER('Hidroizolācijas mat.'!G22),'Hidroizolācijas mat.'!C22,\"\")","v":""},{"$f":"IF(ISNUMBER('Hidroizolācijas mat.'!G22),'Hidroizolācijas mat.'!E22,\"\")","v":""},{"$f":"IF(ISNUMBER('Hidroizolācijas mat.'!G22),'Hidroizolācijas mat.'!G22,\"\")","v":""},{"$f":"IF(ISNUMBER('Hidroizolācijas mat.'!G22),'Hidroizolācijas mat.'!H22,\"\")","v":""},{"$f":"IF(ISTEXT('Hidroizolācijas mat.'!I22),'Hidroizolācijas mat.'!I22,\"\")","v":""},""]
[{"$f":"IF(ISNUMBER('Hidroizolācijas mat.'!G23),'Hidroizolācijas mat.'!A23,\"\")","v":""},{"$f":"IF(ISNUMBER('Hidroizolācijas mat.'!G23),'Hidroizolācijas mat.'!B23,\"\")","v":""},{"$f":"IF(ISNUMBER('Hidroizolācijas mat.'!G23),'Hidroizolācijas mat.'!C23,\"\")","v":""},{"$f":"IF(ISNUMBER('Hidroizolācijas mat.'!G23),'Hidroizolācijas mat.'!E23,\"\")","v":""},{"$f":"IF(ISNUMBER('Hidroizolācijas mat.'!G23),'Hidroizolācijas mat.'!G23,\"\")","v":""},{"$f":"IF(ISNUMBER('Hidroizolācijas mat.'!G23),'Hidroizolācijas mat.'!H23,\"\")","v":""},{"$f":"IF(ISTEXT('Hidroizolācijas mat.'!G23),'Hidroizolācijas mat.'!I23,\"\")","v":""},""]
[{"$f":"IF(ISNUMBER('Sausie m.'!G4),'Sausie m.'!A4,\"\")","v":""},{"$f":"IF(ISNUMBER('Sausie m.'!G4),'Sausie m.'!B4,\"\")","v":""},{"$f":"IF(ISNUMBER('Sausie m.'!G4),'Sausie m.'!C4,\"\")","v":""},{"$f":"IF(ISNUMBER('Sausie m.'!F4),'Sausie m.'!D4,\"\")","v":""},{"$f":"IF(ISNUMBER('Sausie m.'!F4),'Sausie m.'!F4,\"\")","v":""},{"$f":"IF(ISNUMBER('Sausie m.'!F4),'Sausie m.'!G4,\"\")","v":""},{"$f":"IF(ISTEXT('Sausie m.'!H4),'Sausie m.'!H4,\"\")","v":""},""]
[{"$f":"IF(ISNUMBER('Sausie m.'!G5),'Sausie m.'!A5,\"\")","v":""},{"$f":"IF(ISNUMBER('Sausie m.'!G5),'Sausie m.'!B5,\"\")","v":""},{"$f":"IF(ISNUMBER('Sausie m.'!G5),'Sausie m.'!C5,\"\")","v":""},{"$f":"IF(ISNUMBER('Sausie m.'!F5),'Sausie m.'!D5,\"\")","v":""},{"$f":"IF(ISNUMBER('Sausie m.'!F5),'Sausie m.'!F5,\"\")","v":""},{"$f":"IF(ISNUMBER('Sausie m.'!F5),'Sausie m.'!G5,\"\")","v":""},{"$f":"IF(ISTEXT('Sausie m.'!H5),'Sausie m.'!H5,\"\")","v":""},""]
[{"$f":"IF(ISNUMBER('Sausie m.'!G6),'Sausie m.'!A6,\"\")","v":""},{"$f":"IF(ISNUMBER('Sausie m.'!G6),'Sausie m.'!B6,\"\")","v":""},{"$f":"IF(ISNUMBER('Sausie m.'!G6),'Sausie m.'!C6,\"\")","v":""},{"$f":"IF(ISNUMBER('Sausie m.'!F6),'Sausie m.'!D6,\"\")","v":""},{"$f":"IF(ISNUMBER('Sausie m.'!F6),'Sausie m.'!F6,\"\")","v":""},{"$f":"IF(ISNUMBER('Sausie m.'!F6),'Sausie m.'!G6,\"\")","v":""},{"$f":"IF(ISTEXT('Sausie m.'!H6),'Sausie m.'!H6,\"\")","v":""},""]
[{"$f":"IF(ISNUMBER('Sausie m.'!G7),'Sausie m.'!A7,\"\")","v":""},{"$f":"IF(ISNUMBER('Sausie m.'!G7),'Sausie m.'!B7,\"\")","v":""},{"$f":"IF(ISNUMBER('Sausie m.'!G7),'Sausie m.'!C7,\"\")","v":""},{"$f":"IF(ISNUMBER('Sausie m.'!F7),'Sausie m.'!D7,\"\")","v":""},{"$f":"IF(ISNUMBER('Sausie m.'!F7),'Sausie m.'!F7,\"\")","v":""},{"$f":"IF(ISNUMBER('Sausie m.'!F7),'Sausie m.'!G7,\"\")","v":""},{"$f":"IF(ISTEXT('Sausie m.'!H7),'Sausie m.'!H7,\"\")","v":""},""]
[{"$f":"IF(ISNUMBER('Sausie m.'!G8),'Sausie m.'!A8,\"\")","v":""},{"$f":"IF(ISNUMBER('Sausie m.'!G8),'Sausie m.'!B8,\"\")","v":""},{"$f":"IF(ISNUMBER('Sausie m.'!G8),'Sausie m.'!C8,\"\")","v":""},{"$f":"IF(ISNUMBER('Sausie m.'!F8),'Sausie m.'!D8,\"\")","v":""},{"$f":"IF(ISNUMBER('Sausie m.'!F8),'Sausie m.'!F8,\"\")","v":""},{"$f":"IF(ISNUMBER('Sausie m.'!F8),'Sausie m.'!G8,\"\")","v":""},{"$f":"IF(ISTEXT('Sausie m.'!H8),'Sausie m.'!H8,\"\")","v":""},""]
[{"$f":"IF(ISNUMBER('Sausie m.'!G9),'Sausie m.'!A9,\"\")","v":""},{"$f":"IF(ISNUMBER('Sausie m.'!G9),'Sausie m.'!B9,\"\")","v":""},{"$f":"IF(ISNUMBER('Sausie m.'!G9),'Sausie m.'!C9,\"\")","v":""},{"$f":"IF(ISNUMBER('Sausie m.'!F9),'Sausie m.'!D9,\"\")","v":""},{"$f":"IF(ISNUMBER('Sausie m.'!F9),'Sausie m.'!F9,\"\")","v":""},{"$f":"IF(ISNUMBER('Sausie m.'!F9),'Sausie m.'!G9,\"\")","v":""},{"$f":"IF(ISTEXT('Sausie m.'!H9),'Sausie m.'!H9,\"\")","v":""},""]
[{"$f":"IF(ISNUMBER('Sausie m.'!G10),'Sausie m.'!A10,\"\")","v":""},{"$f":"IF(ISNUMBER('Sausie m.'!G10),'Sausie m.'!B10,\"\")","v":""},{"$f":"IF(ISNUMBER('Sausie m.'!G10),'Sausie m.'!C10,\"\")","v":""},{"$f":"IF(ISNUMBER('Sausie m.'!F10),'Sausie m.'!D10,\"\")","v":""},{"$f":"IF(ISNUMBER('Sausie m.'!F10),'Sausie m.'!F10,\"\")","v":""},{"$f":"IF(ISNUMBER('Sausie m.'!F10),'Sausie m.'!G10,\"\")","v":""},{"$f":"IF(ISTEXT('Sausie m.'!H10),'Sausie m.'!H10,\"\")","v":""},""]
[{"$f":"IF(ISNUMBER('Sausie m.'!G11),'Sausie m.'!A11,\"\")","v":""},{"$f":"IF(ISNUMBER('Sausie m.'!G11),'Sausie m.'!B11,\"\")","v":""},{"$f":"IF(ISNUMBER('Sausie m.'!G11),'Sausie m.'!C11,\"\")","v":""},{"$f":"IF(ISNUMBER('Sausie m.'!F11),'Sausie m.'!D11,\"\")","v":""},{"$f":"IF(ISNUMBER('Sausie m.'!F11),'Sausie m.'!F11,\"\")","v":""},{"$f":"IF(ISNUMBER('Sausie m.'!F11),'Sausie m.'!G11,\"\")","v":""},{"$f":"IF(ISTEXT('Sausie m.'!H11),'Sausie m.'!H11,\"\")","v":""},""]
[{"$f":"IF(ISNUMBER('Sausie m.'!G12),'Sausie m.'!A12,\"\")","v":""},{"$f":"IF(ISNUMBER('Sausie m.'!G12),'Sausie m.'!B12,\"\")","v":""},{"$f":"IF(ISNUMBER('Sausie m.'!G12),'Sausie m.'!C12,\"\")","v":""},{"$f":"IF(ISNUMBER('Sausie m.'!F12),'Sausie m.'!D12,\"\")","v":""},{"$f":"IF(ISNUMBER('Sausie m.'!F12),'Sausie m.'!F12,\"\")","v":""},{"$f":"IF(ISNUMBER('Sausie m.'!F12),'Sausie m.'!G12,\"\")","v":""},{"$f":"IF(ISTEXT('Sausie m.'!H12),'Sausie m.'!H12,\"\")","v":""},""]
[{"$f":"IF(ISNUMBER('Sausie m.'!G13),'Sausie m.'!A13,\"\")","v":""},{"$f":"IF(ISNUMBER('Sausie m.'!G13),'Sausie m.'!B13,\"\")","v":""},{"$f":"IF(ISNUMBER('Sausie m.'!G13),'Sausie m.'!C13,\"\")","v":""},{"$f":"IF(ISNUMBER('Sausie m.'!F13),'Sausie m.'!D13,\"\")","v":""},{"$f":"IF(ISNUMBER('Sausie m.'!F13),'Sausie m.'!F13,\"\")","v":""},{"$f":"IF(ISNUMBER('Sausie m.'!F13),'Sausie m.'!G13,\"\")","v":""},{"$f":"IF(ISTEXT('Sausie m.'!H13),'Sausie m.'!H13,\"\")","v":""},""]
[{"$f":"IF(ISNUMBER('Sausie m.'!G14),'Sausie m.'!A14,\"\")","v":""},{"$f":"IF(ISNUMBER('Sausie m.'!G14),'Sausie m.'!B14,\"\")","v":""},{"$f":"IF(ISNUMBER('Sausie m.'!G14),'Sausie m.'!C14,\"\")","v":""},{"$f":"IF(ISNUMBER('Sausie m.'!F14),'Sausie m.'!D14,\"\")","v":""},{"$f":"IF(ISNUMBER('Sausie m.'!F14),'Sausie m.'!F14,\"\")","v":""},{"$f":"IF(ISNUMBER('Sausie m.'!F14),'Sausie m.'!G14,\"\")","v":""},{"$f":"IF(ISTEXT('Sausie m.'!H14),'Sausie m.'!H14,\"\")","v":""},""]
[{"$f":"IF(ISNUMBER('Sausie m.'!G15),'Sausie m.'!A15,\"\")","v":""},{"$f":"IF(ISNUMBER('Sausie m.'!G15),'Sausie m.'!B15,\"\")","v":""},{"$f":"IF(ISNUMBER('Sausie m.'!G15),'Sausie m.'!C15,\"\")","v":""},{"$f":"IF(ISNUMBER('Sausie m.'!F15),'Sausie m.'!D15,\"\")","v":""},{"$f":"IF(ISNUMBER('Sausie m.'!F15),'Sausie m.'!F15,\"\")","v":""},{"$f":"IF(ISNUMBER('Sausie m.'!F15),'Sausie m.'!G15,\"\")","v":""},{"$f":"IF(ISTEXT('Sausie m.'!H15),'Sausie m.'!H15,\"\")","v":""},""]
[{"$f":"IF(ISNUMBER('Sausie m.'!G16),'Sausie m.'!A16,\"\")","v":""},{"$f":"IF(ISNUMBER('Sausie m.'!G16),'Sausie m.'!B16,\"\")","v":""},{"$f":"IF(ISNUMBER('Sausie m.'!G16),'Sausie m.'!C16,\"\")","v":""},{"$f":"IF(ISNUMBER('Sausie m.'!F16),'Sausie m.'!D16,\"\")","v":""},{"$f":"IF(ISNUMBER('Sausie m.'!F16),'Sausie m.'!F16,\"\")","v":""},{"$f":"IF(ISNUMBER('Sausie m.'!F16),'Sausie m.'!G16,\"\")","v":""},{"$f":"IF(ISTEXT('Sausie m.'!H16),'Sausie m.'!H16,\"\")","v":""},""]
[{"$f":"IF(ISNUMBER('Sausie m.'!G17),'Sausie m.'!A17,\"\")","v":""},{"$f":"IF(ISNUMBER('Sausie m.'!G17),'Sausie m.'!B17,\"\")","v":""},{"$f":"IF(ISNUMBER('Sausie m.'!G17),'Sausie m.'!C17,\"\")","v":""},{"$f":"IF(ISNUMBER('Sausie m.'!F17),'Sausie m.'!D17,\"\")","v":""},{"$f":"IF(ISNUMBER('Sausie m.'!F17),'Sausie m.'!F17,\"\")","v":""},{"$f":"IF(ISNUMBER('Sausie m.'!F17),'Sausie m.'!G17,\"\")","v":""},{"$f":"IF(ISTEXT('Sausie m.'!H17),'Sausie m.'!H17,\"\")","v":""},""]
[{"$f":"IF(ISNUMBER('Sausie m.'!G18),'Sausie m.'!A18,\"\")","v":""},{"$f":"IF(ISNUMBER('Sausie m.'!G18),'Sausie m.'!B18,\"\")","v":""},{"$f":"IF(ISNUMBER('Sausie m.'!G18),'Sausie m.'!C18,\"\")","v":""},{"$f":"IF(ISNUMBER('Sausie m.'!F18),'Sausie m.'!D18,\"\")","v":""},{"$f":"IF(ISNUMBER('Sausie m.'!F18),'Sausie m.'!F18,\"\")","v":""},{"$f":"IF(ISNUMBER('Sausie m.'!F18),'Sausie m.'!G18,\"\")","v":""},{"$f":"IF(ISTEXT('Sausie m.'!H18),'Sausie m.'!H18,\"\")","v":""},""]
[{"$f":"IF(ISNUMBER('Sausie m.'!G19),'Sausie m.'!A19,\"\")","v":""},{"$f":"IF(ISNUMBER('Sausie m.'!G19),'Sausie m.'!B19,\"\")","v":""},{"$f":"IF(ISNUMBER('Sausie m.'!G19),'Sausie m.'!C19,\"\")","v":""},{"$f":"IF(ISNUMBER('Sausie m.'!F19),'Sausie m.'!D19,\"\")","v":""},{"$f":"IF(ISNUMBER('Sausie m.'!F19),'Sausie m.'!F19,\"\")","v":""},{"$f":"IF(ISNUMBER('Sausie m.'!F19),'Sausie m.'!G19,\"\")","v":""},{"$f":"IF(ISTEXT('Sausie m.'!H19),'Sausie m.'!H19,\"\")","v":""},""]
[{"$f":"IF(ISNUMBER('Sausie m.'!G20),'Sausie m.'!A20,\"\")","v":""},{"$f":"IF(ISNUMBER('Sausie m.'!G20),'Sausie m.'!B20,\"\")","v":""},{"$f":"IF(ISNUMBER('Sausie m.'!G20),'Sausie m.'!C20,\"\")","v":""},{"$f":"IF(ISNUMBER('Sausie m.'!F20),'Sausie m.'!D20,\"\")","v":""},{"$f":"IF(ISNUMBER('Sausie m.'!F20),'Sausie m.'!F20,\"\")","v":""},{"$f":"IF(ISNUMBER('Sausie m.'!F20),'Sausie m.'!G20,\"\")","v":""},{"$f":"IF(ISTEXT('Sausie m.'!H20),'Sausie m.'!H20,\"\")","v":""},""]
[{"$f":"IF(ISNUMBER('Sausie m.'!G21),'Sausie m.'!A21,\"\")","v":""},{"$f":"IF(ISNUMBER('Sausie m.'!G21),'Sausie m.'!B21,\"\")","v":""},{"$f":"IF(ISNUMBER('Sausie m.'!G21),'Sausie m.'!C21,\"\")","v":""},{"$f":"IF(ISNUMBER('Sausie m.'!F21),'Sausie m.'!D21,\"\")","v":""},{"$f":"IF(ISNUMBER('Sausie m.'!F21),'Sausie m.'!F21,\"\")","v":""},{"$f":"IF(ISNUMBER('Sausie m.'!F21),'Sausie m.'!G21,\"\")","v":""},{"$f":"IF(ISTEXT('Sausie m.'!H21),'Sausie m.'!H21,\"\")","v":""},""]
[{"$f":"IF(ISNUMBER('Sausie m.'!G22),'Sausie m.'!A22,\"\")","v":""},{"$f":"IF(ISNUMBER('Sausie m.'!G22),'Sausie m.'!B22,\"\")","v":""},{"$f":"IF(ISNUMBER('Sausie m.'!G22),'Sausie m.'!C22,\"\")","v":""},{"$f":"IF(ISNUMBER('Sausie m.'!F22),'Sausie m.'!D22,\"\")","v":""},{"$f":"IF(ISNUMBER('Sausie m.'!F22),'Sausie m.'!F22,\"\")","v":""},{"$f":"IF(ISNUMBER('Sausie m.'!F22),'Sausie m.'!G22,\"\")","v":""},{"$f":"IF(ISTEXT('Sausie m.'!H22),'Sausie m.'!H22,\"\")","v":""},""]
[{"$f":"IF(ISNUMBER('Sausie m.'!G23),'Sausie m.'!A23,\"\")","v":""},{"$f":"IF(ISNUMBER('Sausie m.'!G23),'Sausie m.'!B23,\"\")","v":""},{"$f":"IF(ISNUMBER('Sausie m.'!G23),'Sausie m.'!C23,\"\")","v":""},{"$f":"IF(ISNUMBER('Sausie m.'!F23),'Sausie m.'!D23,\"\")","v":""},{"$f":"IF(ISNUMBER('Sausie m.'!F23),'Sausie m.'!F23,\"\")","v":""},{"$f":"IF(ISNUMBER('Sausie m.'!F23),'Sausie m.'!G23,\"\")","v":""},{"$f":"IF(ISTEXT('Sausie m.'!H23),'Sausie m.'!H23,\"\")","v":""},""]
[{"$f":"IF(ISNUMBER('Sausie m.'!G24),'Sausie m.'!A24,\"\")","v":""},{"$f":"IF(ISNUMBER('Sausie m.'!G24),'Sausie m.'!B24,\"\")","v":""},{"$f":"IF(ISNUMBER('Sausie m.'!G24),'Sausie m.'!C24,\"\")","v":""},{"$f":"IF(ISNUMBER('Sausie m.'!F24),'Sausie m.'!D24,\"\")","v":""},{"$f":"IF(ISNUMBER('Sausie m.'!F24),'Sausie m.'!F24,\"\")","v":""},{"$f":"IF(ISNUMBER('Sausie m.'!F24),'Sausie m.'!G24,\"\")","v":""},{"$f":"IF(ISTEXT('Sausie m.'!H24),'Sausie m.'!H24,\"\")","v":""},""]
[{"$f":"IF(ISNUMBER('Sausie m.'!G25),'Sausie m.'!A25,\"\")","v":""},{"$f":"IF(ISNUMBER('Sausie m.'!G25),'Sausie m.'!B25,\"\")","v":""},{"$f":"IF(ISNUMBER('Sausie m.'!G25),'Sausie m.'!C25,\"\")","v":""},{"$f":"IF(ISNUMBER('Sausie m.'!F25),'Sausie m.'!D25,\"\")","v":""},{"$f":"IF(ISNUMBER('Sausie m.'!F25),'Sausie m.'!F25,\"\")","v":""},{"$f":"IF(ISNUMBER('Sausie m.'!F25),'Sausie m.'!G25,\"\")","v":""},{"$f":"IF(ISTEXT('Sausie m.'!H25),'Sausie m.'!H25,\"\")","v":""},""]
[{"$f":"IF(ISNUMBER('Sausie m.'!G26),'Sausie m.'!A26,\"\")","v":""},{"$f":"IF(ISNUMBER('Sausie m.'!G26),'Sausie m.'!B26,\"\")","v":""},{"$f":"IF(ISNUMBER('Sausie m.'!G26),'Sausie m.'!C26,\"\")","v":""},{"$f":"IF(ISNUMBER('Sausie m.'!F26),'Sausie m.'!D26,\"\")","v":""},{"$f":"IF(ISNUMBER('Sausie m.'!F26),'Sausie m.'!F26,\"\")","v":""},{"$f":"IF(ISNUMBER('Sausie m.'!F26),'Sausie m.'!G26,\"\")","v":""},{"$f":"IF(ISTEXT('Sausie m.'!H26),'Sausie m.'!H26,\"\")","v":""},""]
[{"$f":"IF(ISNUMBER('Sausie m.'!G27),'Sausie m.'!A27,\"\")","v":""},{"$f":"IF(ISNUMBER('Sausie m.'!G27),'Sausie m.'!B27,\"\")","v":""},{"$f":"IF(ISNUMBER('Sausie m.'!G27),'Sausie m.'!C27,\"\")","v":""},{"$f":"IF(ISNUMBER('Sausie m.'!F27),'Sausie m.'!D27,\"\")","v":""},{"$f":"IF(ISNUMBER('Sausie m.'!F27),'Sausie m.'!F27,\"\")","v":""},{"$f":"IF(ISNUMBER('Sausie m.'!F27),'Sausie m.'!G27,\"\")","v":""},{"$f":"IF(ISTEXT('Sausie m.'!H27),'Sausie m.'!H27,\"\")","v":""},""]
[{"$f":"IF(ISNUMBER('Sausie m.'!G28),'Sausie m.'!A28,\"\")","v":""},{"$f":"IF(ISNUMBER('Sausie m.'!G28),'Sausie m.'!B28,\"\")","v":""},{"$f":"IF(ISNUMBER('Sausie m.'!G28),'Sausie m.'!C28,\"\")","v":""},{"$f":"IF(ISNUMBER('Sausie m.'!F28),'Sausie m.'!D28,\"\")","v":""},{"$f":"IF(ISNUMBER('Sausie m.'!F28),'Sausie m.'!F28,\"\")","v":""},{"$f":"IF(ISNUMBER('Sausie m.'!F28),'Sausie m.'!G28,\"\")","v":""},{"$f":"IF(ISTEXT('Sausie m.'!H28),'Sausie m.'!H28,\"\")","v":""},""]
[{"$f":"IF(ISNUMBER('Sausie m.'!G29),'Sausie m.'!A29,\"\")","v":""},{"$f":"IF(ISNUMBER('Sausie m.'!G29),'Sausie m.'!B29,\"\")","v":""},{"$f":"IF(ISNUMBER('Sausie m.'!G29),'Sausie m.'!C29,\"\")","v":""},{"$f":"IF(ISNUMBER('Sausie m.'!F29),'Sausie m.'!D29,\"\")","v":""},{"$f":"IF(ISNUMBER('Sausie m.'!F29),'Sausie m.'!F29,\"\")","v":""},{"$f":"IF(ISNUMBER('Sausie m.'!F29),'Sausie m.'!G29,\"\")","v":""},{"$f":"IF(ISTEXT('Sausie m.'!H29),'Sausie m.'!H29,\"\")","v":""},""]
[{"$f":"IF(ISNUMBER('Sausie m.'!G30),'Sausie m.'!A30,\"\")","v":""},{"$f":"IF(ISNUMBER('Sausie m.'!G30),'Sausie m.'!B30,\"\")","v":""},{"$f":"IF(ISNUMBER('Sausie m.'!G30),'Sausie m.'!C30,\"\")","v":""},{"$f":"IF(ISNUMBER('Sausie m.'!F30),'Sausie m.'!D30,\"\")","v":""},{"$f":"IF(ISNUMBER('Sausie m.'!F30),'Sausie m.'!F30,\"\")","v":""},{"$f":"IF(ISNUMBER('Sausie m.'!F30),'Sausie m.'!G30,\"\")","v":""},{"$f":"IF(ISTEXT('Sausie m.'!H30),'Sausie m.'!H30,\"\")","v":""},""]
[{"$f":"IF(ISNUMBER('Sausie m.'!G31),'Sausie m.'!A31,\"\")","v":""},{"$f":"IF(ISNUMBER('Sausie m.'!G31),'Sausie m.'!B31,\"\")","v":""},{"$f":"IF(ISNUMBER('Sausie m.'!G31),'Sausie m.'!C31,\"\")","v":""},{"$f":"IF(ISNUMBER('Sausie m.'!F31),'Sausie m.'!D31,\"\")","v":""},{"$f":"IF(ISNUMBER('Sausie m.'!F31),'Sausie m.'!F31,\"\")","v":""},{"$f":"IF(ISNUMBER('Sausie m.'!F31),'Sausie m.'!G31,\"\")","v":""},{"$f":"IF(ISTEXT('Sausie m.'!H31),'Sausie m.'!H31,\"\")","v":""},""]
[{"$f":"IF(ISNUMBER('Sausie m.'!G32),'Sausie m.'!A32,\"\")","v":""},{"$f":"IF(ISNUMBER('Sausie m.'!G32),'Sausie m.'!B32,\"\")","v":""},{"$f":"IF(ISNUMBER('Sausie m.'!G32),'Sausie m.'!C32,\"\")","v":""},{"$f":"IF(ISNUMBER('Sausie m.'!F32),'Sausie m.'!D32,\"\")","v":""},{"$f":"IF(ISNUMBER('Sausie m.'!F32),'Sausie m.'!F32,\"\")","v":""},{"$f":"IF(ISNUMBER('Sausie m.'!F32),'Sausie m.'!G32,\"\")","v":""},{"$f":"IF(ISTEXT('Sausie m.'!H32),'Sausie m.'!H32,\"\")","v":""},""]
[{"$f":"IF(ISNUMBER('Sausie m.'!G33),'Sausie m.'!A33,\"\")","v":""},{"$f":"IF(ISNUMBER('Sausie m.'!G33),'Sausie m.'!B33,\"\")","v":""},{"$f":"IF(ISNUMBER('Sausie m.'!G33),'Sausie m.'!C33,\"\")","v":""},{"$f":"IF(ISNUMBER('Sausie m.'!F33),'Sausie m.'!D33,\"\")","v":""},{"$f":"IF(ISNUMBER('Sausie m.'!F33),'Sausie m.'!F33,\"\")","v":""},{"$f":"IF(ISNUMBER('Sausie m.'!F33),'Sausie m.'!G33,\"\")","v":""},{"$f":"IF(ISTEXT('Sausie m.'!H33),'Sausie m.'!H33,\"\")","v":""},""]
[{"$f":"IF(ISNUMBER('Sausie m.'!G34),'Sausie m.'!A34,\"\")","v":""},{"$f":"IF(ISNUMBER('Sausie m.'!G34),'Sausie m.'!B34,\"\")","v":""},{"$f":"IF(ISNUMBER('Sausie m.'!G34),'Sausie m.'!C34,\"\")","v":""},{"$f":"IF(ISNUMBER('Sausie m.'!F34),'Sausie m.'!D34,\"\")","v":""},{"$f":"IF(ISNUMBER('Sausie m.'!F34),'Sausie m.'!F34,\"\")","v":""},{"$f":"IF(ISNUMBER('Sausie m.'!F34),'Sausie m.'!G34,\"\")","v":""},{"$f":"IF(ISTEXT('Sausie m.'!H34),'Sausie m.'!H34,\"\")","v":""},""]
[{"$f":"IF(ISNUMBER('Sausie m.'!G35),'Sausie m.'!A35,\"\")","v":""},{"$f":"IF(ISNUMBER('Sausie m.'!G35),'Sausie m.'!B35,\"\")","v":""},{"$f":"IF(ISNUMBER('Sausie m.'!G35),'Sausie m.'!C35,\"\")","v":""},{"$f":"IF(ISNUMBER('Sausie m.'!F35),'Sausie m.'!D35,\"\")","v":""},{"$f":"IF(ISNUMBER('Sausie m.'!F35),'Sausie m.'!F35,\"\")","v":""},{"$f":"IF(ISNUMBER('Sausie m.'!F35),'Sausie m.'!G35,\"\")","v":""},{"$f":"IF(ISTEXT('Sausie m.'!H35),'Sausie m.'!H35,\"\")","v":""},""]
[{"$f":"IF(ISNUMBER('Sausie m.'!G36),'Sausie m.'!A36,\"\")","v":""},{"$f":"IF(ISNUMBER('Sausie m.'!G36),'Sausie m.'!B36,\"\")","v":""},{"$f":"IF(ISNUMBER('Sausie m.'!G36),'Sausie m.'!C36,\"\")","v":""},{"$f":"IF(ISNUMBER('Sausie m.'!F36),'Sausie m.'!D36,\"\")","v":""},{"$f":"IF(ISNUMBER('Sausie m.'!F36),'Sausie m.'!F36,\"\")","v":""},{"$f":"IF(ISNUMBER('Sausie m.'!F36),'Sausie m.'!G36,\"\")","v":""},{"$f":"IF(ISTEXT('Sausie m.'!H36),'Sausie m.'!H36,\"\")","v":""},""]
[{"$f":"IF(ISNUMBER('Sausie m.'!G37),'Sausie m.'!A37,\"\")","v":""},{"$f":"IF(ISNUMBER('Sausie m.'!G37),'Sausie m.'!B37,\"\")","v":""},{"$f":"IF(ISNUMBER('Sausie m.'!G37),'Sausie m.'!C37,\"\")","v":""},{"$f":"IF(ISNUMBER('Sausie m.'!F37),'Sausie m.'!D37,\"\")","v":""},{"$f":"IF(ISNUMBER('Sausie m.'!F37),'Sausie m.'!F37,\"\")","v":""},{"$f":"IF(ISNUMBER('Sausie m.'!F37),'Sausie m.'!G37,\"\")","v":""},{"$f":"IF(ISTEXT('Sausie m.'!H37),'Sausie m.'!H37,\"\")","v":""},""]
[{"$f":"IF(ISNUMBER('Sausie m.'!G38),'Sausie m.'!A38,\"\")","v":""},{"$f":"IF(ISNUMBER('Sausie m.'!G38),'Sausie m.'!B38,\"\")","v":""},{"$f":"IF(ISNUMBER('Sausie m.'!G38),'Sausie m.'!C38,\"\")","v":""},{"$f":"IF(ISNUMBER('Sausie m.'!F38),'Sausie m.'!D38,\"\")","v":""},{"$f":"IF(ISNUMBER('Sausie m.'!F38),'Sausie m.'!F38,\"\")","v":""},{"$f":"IF(ISNUMBER('Sausie m.'!F38),'Sausie m.'!G38,\"\")","v":""},{"$f":"IF(ISTEXT('Sausie m.'!H38),'Sausie m.'!H38,\"\")","v":""},""]
[{"$f":"IF(ISNUMBER('Sausie m.'!G39),'Sausie m.'!A39,\"\")","v":""},{"$f":"IF(ISNUMBER('Sausie m.'!G39),'Sausie m.'!B39,\"\")","v":""},{"$f":"IF(ISNUMBER('Sausie m.'!G39),'Sausie m.'!C39,\"\")","v":""},{"$f":"IF(ISNUMBER('Sausie m.'!F39),'Sausie m.'!D39,\"\")","v":""},{"$f":"IF(ISNUMBER('Sausie m.'!F39),'Sausie m.'!F39,\"\")","v":""},{"$f":"IF(ISNUMBER('Sausie m.'!F39),'Sausie m.'!G39,\"\")","v":""},{"$f":"IF(ISTEXT('Sausie m.'!H39),'Sausie m.'!H39,\"\")","v":""},""]
[{"$f":"IF(ISNUMBER('Sausie m.'!G40),'Sausie m.'!A40,\"\")","v":""},{"$f":"IF(ISNUMBER('Sausie m.'!G40),'Sausie m.'!B40,\"\")","v":""},{"$f":"IF(ISNUMBER('Sausie m.'!G40),'Sausie m.'!C40,\"\")","v":""},{"$f":"IF(ISNUMBER('Sausie m.'!F40),'Sausie m.'!D40,\"\")","v":""},{"$f":"IF(ISNUMBER('Sausie m.'!F40),'Sausie m.'!F40,\"\")","v":""},{"$f":"IF(ISNUMBER('Sausie m.'!F40),'Sausie m.'!G40,\"\")","v":""},{"$f":"IF(ISTEXT('Sausie m.'!H40),'Sausie m.'!H40,\"\")","v":""},""]
[{"$f":"IF(ISNUMBER('Sausie m.'!G41),'Sausie m.'!A41,\"\")","v":""},{"$f":"IF(ISNUMBER('Sausie m.'!G41),'Sausie m.'!B41,\"\")","v":""},{"$f":"IF(ISNUMBER('Sausie m.'!G41),'Sausie m.'!C41,\"\")","v":""},{"$f":"IF(ISNUMBER('Sausie m.'!F41),'Sausie m.'!D41,\"\")","v":""},{"$f":"IF(ISNUMBER('Sausie m.'!F41),'Sausie m.'!F41,\"\")","v":""},{"$f":"IF(ISNUMBER('Sausie m.'!F41),'Sausie m.'!G41,\"\")","v":""},{"$f":"IF(ISTEXT('Sausie m.'!H41),'Sausie m.'!H41,\"\")","v":""},""]
[{"$f":"IF(ISNUMBER('Sausie m.'!G42),'Sausie m.'!A42,\"\")","v":""},{"$f":"IF(ISNUMBER('Sausie m.'!G42),'Sausie m.'!B42,\"\")","v":""},{"$f":"IF(ISNUMBER('Sausie m.'!G42),'Sausie m.'!C42,\"\")","v":""},{"$f":"IF(ISNUMBER('Sausie m.'!F42),'Sausie m.'!D42,\"\")","v":""},{"$f":"IF(ISNUMBER('Sausie m.'!F42),'Sausie m.'!F42,\"\")","v":""},{"$f":"IF(ISNUMBER('Sausie m.'!F42),'Sausie m.'!G42,\"\")","v":""},{"$f":"IF(ISTEXT('Sausie m.'!H42),'Sausie m.'!H42,\"\")","v":""},{"$f":"IF(ISNUMBER(E581),\"yes\",\"\")","v":""}]
[{"$f":"IF(ISNUMBER('Sausie m.'!G43),'Sausie m.'!A43,\"\")","v":""},{"$f":"IF(ISNUMBER('Sausie m.'!G43),'Sausie m.'!B43,\"\")","v":""},{"$f":"IF(ISNUMBER('Sausie m.'!G43),'Sausie m.'!C43,\"\")","v":""},{"$f":"IF(ISNUMBER('Sausie m.'!F43),'Sausie m.'!D43,\"\")","v":""},{"$f":"IF(ISNUMBER('Sausie m.'!F43),'Sausie m.'!F43,\"\")","v":""},{"$f":"IF(ISNUMBER('Sausie m.'!F43),'Sausie m.'!G43,\"\")","v":""},{"$f":"IF(ISTEXT('Sausie m.'!H43),'Sausie m.'!H43,\"\")","v":""},""]
[{"$f":"IF(ISNUMBER('Sausie m.'!G44),'Sausie m.'!A44,\"\")","v":""},{"$f":"IF(ISNUMBER('Sausie m.'!G44),'Sausie m.'!B44,\"\")","v":""},{"$f":"IF(ISNUMBER('Sausie m.'!G44),'Sausie m.'!C44,\"\")","v":""},{"$f":"IF(ISNUMBER('Sausie m.'!F44),'Sausie m.'!D44,\"\")","v":""},{"$f":"IF(ISNUMBER('Sausie m.'!F44),'Sausie m.'!F44,\"\")","v":""},{"$f":"IF(ISNUMBER('Sausie m.'!F44),'Sausie m.'!G44,\"\")","v":""},{"$f":"IF(ISTEXT('Sausie m.'!H44),'Sausie m.'!H44,\"\")","v":""},""]
[{"$f":"IF(ISNUMBER('Sausie m.'!G45),'Sausie m.'!A45,\"\")","v":""},{"$f":"IF(ISNUMBER('Sausie m.'!G45),'Sausie m.'!B45,\"\")","v":""},{"$f":"IF(ISNUMBER('Sausie m.'!G45),'Sausie m.'!C45,\"\")","v":""},{"$f":"IF(ISNUMBER('Sausie m.'!F45),'Sausie m.'!D45,\"\")","v":""},{"$f":"IF(ISNUMBER('Sausie m.'!F45),'Sausie m.'!F45,\"\")","v":""},{"$f":"IF(ISNUMBER('Sausie m.'!F45),'Sausie m.'!G45,\"\")","v":""},{"$f":"IF(ISTEXT('Sausie m.'!H45),'Sausie m.'!H45,\"\")","v":""},""]
[{"$f":"IF(ISNUMBER('Sausie m.'!G46),'Sausie m.'!A46,\"\")","v":""},{"$f":"IF(ISNUMBER('Sausie m.'!G46),'Sausie m.'!B46,\"\")","v":""},{"$f":"IF(ISNUMBER('Sausie m.'!G46),'Sausie m.'!C46,\"\")","v":""},{"$f":"IF(ISNUMBER('Sausie m.'!F46),'Sausie m.'!D46,\"\")","v":""},{"$f":"IF(ISNUMBER('Sausie m.'!F46),'Sausie m.'!F46,\"\")","v":""},{"$f":"IF(ISNUMBER('Sausie m.'!F46),'Sausie m.'!G46,\"\")","v":""},{"$f":"IF(ISTEXT('Sausie m.'!H46),'Sausie m.'!H46,\"\")","v":""},""]
[{"$f":"IF(ISNUMBER('Sausie m.'!G47),'Sausie m.'!A47,\"\")","v":""},{"$f":"IF(ISNUMBER('Sausie m.'!G47),'Sausie m.'!B47,\"\")","v":""},{"$f":"IF(ISNUMBER('Sausie m.'!G47),'Sausie m.'!C47,\"\")","v":""},{"$f":"IF(ISNUMBER('Sausie m.'!F47),'Sausie m.'!D47,\"\")","v":""},{"$f":"IF(ISNUMBER('Sausie m.'!F47),'Sausie m.'!F47,\"\")","v":""},{"$f":"IF(ISNUMBER('Sausie m.'!F47),'Sausie m.'!G47,\"\")","v":""},{"$f":"IF(ISTEXT('Sausie m.'!H47),'Sausie m.'!H47,\"\")","v":""},""]
[{"$f":"IF(ISNUMBER('Sausie m.'!G48),'Sausie m.'!A48,\"\")","v":""},{"$f":"IF(ISNUMBER('Sausie m.'!G48),'Sausie m.'!B48,\"\")","v":""},{"$f":"IF(ISNUMBER('Sausie m.'!G48),'Sausie m.'!C48,\"\")","v":""},{"$f":"IF(ISNUMBER('Sausie m.'!F48),'Sausie m.'!D48,\"\")","v":""},{"$f":"IF(ISNUMBER('Sausie m.'!F48),'Sausie m.'!F48,\"\")","v":""},{"$f":"IF(ISNUMBER('Sausie m.'!F48),'Sausie m.'!G48,\"\")","v":""},{"$f":"IF(ISTEXT('Sausie m.'!H48),'Sausie m.'!H48,\"\")","v":""},""]
[{"$f":"IF(ISNUMBER('Sausie m.'!G49),'Sausie m.'!A49,\"\")","v":""},{"$f":"IF(ISNUMBER('Sausie m.'!G49),'Sausie m.'!B49,\"\")","v":""},{"$f":"IF(ISNUMBER('Sausie m.'!G49),'Sausie m.'!C49,\"\")","v":""},{"$f":"IF(ISNUMBER('Sausie m.'!F49),'Sausie m.'!D49,\"\")","v":""},{"$f":"IF(ISNUMBER('Sausie m.'!F49),'Sausie m.'!F49,\"\")","v":""},{"$f":"IF(ISNUMBER('Sausie m.'!F49),'Sausie m.'!G49,\"\")","v":""},{"$f":"IF(ISTEXT('Sausie m.'!H49),'Sausie m.'!H49,\"\")","v":""},""]
[{"$f":"IF(ISNUMBER('Sausie m.'!G50),'Sausie m.'!A50,\"\")","v":""},{"$f":"IF(ISNUMBER('Sausie m.'!G50),'Sausie m.'!B50,\"\")","v":""},{"$f":"IF(ISNUMBER('Sausie m.'!G50),'Sausie m.'!C50,\"\")","v":""},{"$f":"IF(ISNUMBER('Sausie m.'!F50),'Sausie m.'!D50,\"\")","v":""},{"$f":"IF(ISNUMBER('Sausie m.'!F50),'Sausie m.'!F50,\"\")","v":""},{"$f":"IF(ISNUMBER('Sausie m.'!F50),'Sausie m.'!G50,\"\")","v":""},{"$f":"IF(ISTEXT('Sausie m.'!H50),'Sausie m.'!H50,\"\")","v":""},""]
[{"$f":"IF(ISNUMBER('Sausie m.'!G51),'Sausie m.'!A51,\"\")","v":""},{"$f":"IF(ISNUMBER('Sausie m.'!G51),'Sausie m.'!B51,\"\")","v":""},{"$f":"IF(ISNUMBER('Sausie m.'!G51),'Sausie m.'!C51,\"\")","v":""},{"$f":"IF(ISNUMBER('Sausie m.'!F51),'Sausie m.'!D51,\"\")","v":""},{"$f":"IF(ISNUMBER('Sausie m.'!F51),'Sausie m.'!F51,\"\")","v":""},{"$f":"IF(ISNUMBER('Sausie m.'!F51),'Sausie m.'!G51,\"\")","v":""},{"$f":"IF(ISTEXT('Sausie m.'!H51),'Sausie m.'!H51,\"\")","v":""},""]
[{"$f":"IF(ISNUMBER('Sausie m.'!G52),'Sausie m.'!A52,\"\")","v":""},{"$f":"IF(ISNUMBER('Sausie m.'!G52),'Sausie m.'!B52,\"\")","v":""},{"$f":"IF(ISNUMBER('Sausie m.'!G52),'Sausie m.'!C52,\"\")","v":""},{"$f":"IF(ISNUMBER('Sausie m.'!F52),'Sausie m.'!D52,\"\")","v":""},{"$f":"IF(ISNUMBER('Sausie m.'!F52),'Sausie m.'!F52,\"\")","v":""},{"$f":"IF(ISNUMBER('Sausie m.'!F52),'Sausie m.'!G52,\"\")","v":""},{"$f":"IF(ISTEXT('Sausie m.'!H52),'Sausie m.'!H52,\"\")","v":""},""]
[{"$f":"IF(ISNUMBER('Sausie m.'!G53),'Sausie m.'!A53,\"\")","v":""},{"$f":"IF(ISNUMBER('Sausie m.'!G53),'Sausie m.'!B53,\"\")","v":""},{"$f":"IF(ISNUMBER('Sausie m.'!G53),'Sausie m.'!C53,\"\")","v":""},{"$f":"IF(ISNUMBER('Sausie m.'!F53),'Sausie m.'!D53,\"\")","v":""},{"$f":"IF(ISNUMBER('Sausie m.'!F53),'Sausie m.'!F53,\"\")","v":""},{"$f":"IF(ISNUMBER('Sausie m.'!F53),'Sausie m.'!G53,\"\")","v":""},{"$f":"IF(ISTEXT('Sausie m.'!H53),'Sausie m.'!H53,\"\")","v":""},""]
[{"$f":"IF(ISNUMBER('Sausie m.'!G54),'Sausie m.'!A54,\"\")","v":""},{"$f":"IF(ISNUMBER('Sausie m.'!G54),'Sausie m.'!B54,\"\")","v":""},{"$f":"IF(ISNUMBER('Sausie m.'!G54),'Sausie m.'!C54,\"\")","v":""},{"$f":"IF(ISNUMBER('Sausie m.'!F54),'Sausie m.'!D54,\"\")","v":""},{"$f":"IF(ISNUMBER('Sausie m.'!F54),'Sausie m.'!F54,\"\")","v":""},{"$f":"IF(ISNUMBER('Sausie m.'!F54),'Sausie m.'!G54,\"\")","v":""},{"$f":"IF(ISTEXT('Sausie m.'!H54),'Sausie m.'!H54,\"\")","v":""},""]
[{"$f":"IF(ISNUMBER('Sausie m.'!G55),'Sausie m.'!A55,\"\")","v":""},{"$f":"IF(ISNUMBER('Sausie m.'!G55),'Sausie m.'!B55,\"\")","v":""},{"$f":"IF(ISNUMBER('Sausie m.'!G55),'Sausie m.'!C55,\"\")","v":""},{"$f":"IF(ISNUMBER('Sausie m.'!F55),'Sausie m.'!D55,\"\")","v":""},{"$f":"IF(ISNUMBER('Sausie m.'!F55),'Sausie m.'!F55,\"\")","v":""},{"$f":"IF(ISNUMBER('Sausie m.'!F55),'Sausie m.'!G55,\"\")","v":""},{"$f":"IF(ISTEXT('Sausie m.'!H55),'Sausie m.'!H55,\"\")","v":""},""]
[{"$f":"IF(ISNUMBER('Sausie m.'!G56),'Sausie m.'!#REF!,\"\")","v":""},{"$f":"IF(ISNUMBER('Sausie m.'!G56),'Sausie m.'!A56,\"\")","v":""},{"$f":"IF(ISNUMBER('Sausie m.'!G56),'Sausie m.'!C56,\"\")","v":""},{"$f":"IF(ISNUMBER('Sausie m.'!F56),'Sausie m.'!D56,\"\")","v":""},{"$f":"IF(ISNUMBER('Sausie m.'!F56),'Sausie m.'!F56,\"\")","v":""},{"$f":"IF(ISNUMBER('Sausie m.'!F56),'Sausie m.'!G56,\"\")","v":""},{"$f":"IF(ISTEXT('Sausie m.'!H56),'Sausie m.'!H56,\"\")","v":""},""]
[{"$f":"IF(ISNUMBER('Sausie m.'!G57),'Sausie m.'!A57,\"\")","v":""},{"$f":"IF(ISNUMBER('Sausie m.'!G57),'Sausie m.'!B57,\"\")","v":""},{"$f":"IF(ISNUMBER('Sausie m.'!G57),'Sausie m.'!C57,\"\")","v":""},{"$f":"IF(ISNUMBER('Sausie m.'!F57),'Sausie m.'!D57,\"\")","v":""},{"$f":"IF(ISNUMBER('Sausie m.'!F57),'Sausie m.'!F57,\"\")","v":""},{"$f":"IF(ISNUMBER('Sausie m.'!F57),'Sausie m.'!G57,\"\")","v":""},{"$f":"IF(ISTEXT('Sausie m.'!H57),'Sausie m.'!H57,\"\")","v":""},""]
[{"$f":"IF(ISNUMBER('Sausie m.'!G58),'Sausie m.'!A58,\"\")","v":""},{"$f":"IF(ISNUMBER('Sausie m.'!G58),'Sausie m.'!B58,\"\")","v":""},{"$f":"IF(ISNUMBER('Sausie m.'!G58),'Sausie m.'!C58,\"\")","v":""},{"$f":"IF(ISNUMBER('Sausie m.'!F58),'Sausie m.'!D58,\"\")","v":""},{"$f":"IF(ISNUMBER('Sausie m.'!F58),'Sausie m.'!F58,\"\")","v":""},{"$f":"IF(ISNUMBER('Sausie m.'!F58),'Sausie m.'!G58,\"\")","v":""},{"$f":"IF(ISTEXT('Sausie m.'!H58),'Sausie m.'!H58,\"\")","v":""},""]
[{"$f":"IF(ISNUMBER('Sausie m.'!G59),'Sausie m.'!A59,\"\")","v":""},{"$f":"IF(ISNUMBER('Sausie m.'!G59),'Sausie m.'!B59,\"\")","v":""},{"$f":"IF(ISNUMBER('Sausie m.'!G59),'Sausie m.'!C59,\"\")","v":""},{"$f":"IF(ISNUMBER('Sausie m.'!F59),'Sausie m.'!D59,\"\")","v":""},{"$f":"IF(ISNUMBER('Sausie m.'!F59),'Sausie m.'!F59,\"\")","v":""},{"$f":"IF(ISNUMBER('Sausie m.'!F59),'Sausie m.'!G59,\"\")","v":""},{"$f":"IF(ISTEXT('Sausie m.'!H59),'Sausie m.'!H59,\"\")","v":""},""]
[{"$f":"IF(ISNUMBER('Sausie m.'!G60),'Sausie m.'!A60,\"\")","v":""},{"$f":"IF(ISNUMBER('Sausie m.'!G60),'Sausie m.'!B60,\"\")","v":""},{"$f":"IF(ISNUMBER('Sausie m.'!G60),'Sausie m.'!C60,\"\")","v":""},{"$f":"IF(ISNUMBER('Sausie m.'!F60),'Sausie m.'!D60,\"\")","v":""},{"$f":"IF(ISNUMBER('Sausie m.'!F60),'Sausie m.'!F60,\"\")","v":""},{"$f":"IF(ISNUMBER('Sausie m.'!F60),'Sausie m.'!G60,\"\")","v":""},{"$f":"IF(ISTEXT('Sausie m.'!H60),'Sausie m.'!H60,\"\")","v":""},""]
[{"$f":"IF(ISNUMBER('Sausie m.'!G61),'Sausie m.'!A61,\"\")","v":""},{"$f":"IF(ISNUMBER('Sausie m.'!G61),'Sausie m.'!B61,\"\")","v":""},{"$f":"IF(ISNUMBER('Sausie m.'!G61),'Sausie m.'!C61,\"\")","v":""},{"$f":"IF(ISNUMBER('Sausie m.'!F61),'Sausie m.'!D61,\"\")","v":""},{"$f":"IF(ISNUMBER('Sausie m.'!F61),'Sausie m.'!F61,\"\")","v":""},{"$f":"IF(ISNUMBER('Sausie m.'!F61),'Sausie m.'!G61,\"\")","v":""},{"$f":"IF(ISTEXT('Sausie m.'!H61),'Sausie m.'!H61,\"\")","v":""},""]
[]
[{"$f":"IF(ISNUMBER(Būvkalumi!G4),Būvkalumi!A4,\"\")","v":""},{"$f":"IF(ISNUMBER(Būvkalumi!G4),Būvkalumi!B4,\"\")","v":""},{"$f":"IF(ISNUMBER(Būvkalumi!G4),Būvkalumi!C4,\"\")","v":""},{"$f":"IF(ISNUMBER(Būvkalumi!G4),Būvkalumi!E4,\"\")","v":""},{"$f":"IF(ISNUMBER(Būvkalumi!G4),Būvkalumi!G4,\"\")","v":""},{"$f":"IF(ISNUMBER(Būvkalumi!G4),Būvkalumi!H4,\"\")","v":""},{"$f":"IF(ISTEXT(Būvkalumi!I4),Būvkalumi!I4,\"\")","v":""},{"$f":"IF(ISNUMBER(E602),\"yes\",\"\")","v":""}]
[{"$f":"IF(ISNUMBER(Būvkalumi!G5),Būvkalumi!A5,\"\")","v":""},{"$f":"IF(ISNUMBER(Būvkalumi!G5),Būvkalumi!B5,\"\")","v":""},{"$f":"IF(ISNUMBER(Būvkalumi!G5),Būvkalumi!C5,\"\")","v":""},{"$f":"IF(ISNUMBER(Būvkalumi!G5),Būvkalumi!E5,\"\")","v":""},{"$f":"IF(ISNUMBER(Būvkalumi!G5),Būvkalumi!G5,\"\")","v":""},{"$f":"IF(ISNUMBER(Būvkalumi!G5),Būvkalumi!H5,\"\")","v":""},{"$f":"IF(ISTEXT(Būvkalumi!I5),Būvkalumi!I5,\"\")","v":""},{"$f":"IF(ISNUMBER(E603),\"yes\",\"\")","v":""}]
[{"$f":"IF(ISNUMBER(Būvkalumi!G6),Būvkalumi!A6,\"\")","v":""},{"$f":"IF(ISNUMBER(Būvkalumi!G6),Būvkalumi!B6,\"\")","v":""},{"$f":"IF(ISNUMBER(Būvkalumi!G6),Būvkalumi!C6,\"\")","v":""},{"$f":"IF(ISNUMBER(Būvkalumi!G6),Būvkalumi!E6,\"\")","v":""},{"$f":"IF(ISNUMBER(Būvkalumi!G6),Būvkalumi!G6,\"\")","v":""},{"$f":"IF(ISNUMBER(Būvkalumi!G6),Būvkalumi!H6,\"\")","v":""},{"$f":"IF(ISTEXT(Būvkalumi!I6),Būvkalumi!I6,\"\")","v":""},""]
[{"$f":"IF(ISNUMBER(Būvkalumi!G7),Būvkalumi!A7,\"\")","v":""},{"$f":"IF(ISNUMBER(Būvkalumi!G7),Būvkalumi!B7,\"\")","v":""},{"$f":"IF(ISNUMBER(Būvkalumi!G7),Būvkalumi!C7,\"\")","v":""},{"$f":"IF(ISNUMBER(Būvkalumi!G7),Būvkalumi!E7,\"\")","v":""},{"$f":"IF(ISNUMBER(Būvkalumi!G7),Būvkalumi!G7,\"\")","v":""},{"$f":"IF(ISNUMBER(Būvkalumi!G7),Būvkalumi!H7,\"\")","v":""},{"$f":"IF(ISTEXT(Būvkalumi!I7),Būvkalumi!I7,\"\")","v":""},""]
[{"$f":"IF(ISNUMBER(Būvkalumi!G8),Būvkalumi!A8,\"\")","v":""},{"$f":"IF(ISNUMBER(Būvkalumi!G8),Būvkalumi!B8,\"\")","v":""},{"$f":"IF(ISNUMBER(Būvkalumi!G8),Būvkalumi!C8,\"\")","v":""},{"$f":"IF(ISNUMBER(Būvkalumi!G8),Būvkalumi!E8,\"\")","v":""},{"$f":"IF(ISNUMBER(Būvkalumi!G8),Būvkalumi!G8,\"\")","v":""},{"$f":"IF(ISNUMBER(Būvkalumi!G8),Būvkalumi!H8,\"\")","v":""},{"$f":"IF(ISTEXT(Būvkalumi!I8),Būvkalumi!I8,\"\")","v":""},""]
[{"$f":"IF(ISNUMBER(Būvkalumi!G9),Būvkalumi!A9,\"\")","v":""},{"$f":"IF(ISNUMBER(Būvkalumi!G9),Būvkalumi!B9,\"\")","v":""},{"$f":"IF(ISNUMBER(Būvkalumi!G9),Būvkalumi!C9,\"\")","v":""},{"$f":"IF(ISNUMBER(Būvkalumi!G9),Būvkalumi!E9,\"\")","v":""},{"$f":"IF(ISNUMBER(Būvkalumi!G9),Būvkalumi!G9,\"\")","v":""},{"$f":"IF(ISNUMBER(Būvkalumi!G9),Būvkalumi!H9,\"\")","v":""},{"$f":"IF(ISTEXT(Būvkalumi!I9),Būvkalumi!I9,\"\")","v":""},""]
[{"$f":"IF(ISNUMBER(Būvkalumi!G10),Būvkalumi!A10,\"\")","v":""},{"$f":"IF(ISNUMBER(Būvkalumi!G10),Būvkalumi!B10,\"\")","v":""},{"$f":"IF(ISNUMBER(Būvkalumi!G10),Būvkalumi!C10,\"\")","v":""},{"$f":"IF(ISNUMBER(Būvkalumi!G10),Būvkalumi!E10,\"\")","v":""},{"$f":"IF(ISNUMBER(Būvkalumi!G10),Būvkalumi!G10,\"\")","v":""},{"$f":"IF(ISNUMBER(Būvkalumi!G10),Būvkalumi!H10,\"\")","v":""},{"$f":"IF(ISTEXT(Būvkalumi!I10),Būvkalumi!I10,\"\")","v":""},""]
[{"$f":"IF(ISNUMBER(Būvkalumi!G11),Būvkalumi!A11,\"\")","v":""},{"$f":"IF(ISNUMBER(Būvkalumi!G11),Būvkalumi!B11,\"\")","v":""},{"$f":"IF(ISNUMBER(Būvkalumi!G11),Būvkalumi!C11,\"\")","v":""},{"$f":"IF(ISNUMBER(Būvkalumi!G11),Būvkalumi!E11,\"\")","v":""},{"$f":"IF(ISNUMBER(Būvkalumi!G11),Būvkalumi!G11,\"\")","v":""},{"$f":"IF(ISNUMBER(Būvkalumi!G11),Būvkalumi!H11,\"\")","v":""},{"$f":"IF(ISTEXT(Būvkalumi!I11),Būvkalumi!I11,\"\")","v":""},""]
[{"$f":"IF(ISNUMBER(Būvkalumi!G12),Būvkalumi!A12,\"\")","v":""},{"$f":"IF(ISNUMBER(Būvkalumi!G12),Būvkalumi!B12,\"\")","v":""},{"$f":"IF(ISNUMBER(Būvkalumi!G12),Būvkalumi!C12,\"\")","v":""},{"$f":"IF(ISNUMBER(Būvkalumi!G12),Būvkalumi!E12,\"\")","v":""},{"$f":"IF(ISNUMBER(Būvkalumi!G12),Būvkalumi!G12,\"\")","v":""},{"$f":"IF(ISNUMBER(Būvkalumi!G12),Būvkalumi!H12,\"\")","v":""},{"$f":"IF(ISTEXT(Būvkalumi!I12),Būvkalumi!I12,\"\")","v":""},""]
[{"$f":"IF(ISNUMBER(Būvkalumi!G13),Būvkalumi!A13,\"\")","v":""},{"$f":"IF(ISNUMBER(Būvkalumi!G13),Būvkalumi!B13,\"\")","v":""},{"$f":"IF(ISNUMBER(Būvkalumi!G13),Būvkalumi!C13,\"\")","v":""},{"$f":"IF(ISNUMBER(Būvkalumi!G13),Būvkalumi!E13,\"\")","v":""},{"$f":"IF(ISNUMBER(Būvkalumi!G13),Būvkalumi!G13,\"\")","v":""},{"$f":"IF(ISNUMBER(Būvkalumi!G13),Būvkalumi!H13,\"\")","v":""},{"$f":"IF(ISTEXT(Būvkalumi!I13),Būvkalumi!I13,\"\")","v":""},""]
[{"$f":"IF(ISNUMBER(Būvkalumi!G14),Būvkalumi!A14,\"\")","v":""},{"$f":"IF(ISNUMBER(Būvkalumi!G14),Būvkalumi!B14,\"\")","v":""},{"$f":"IF(ISNUMBER(Būvkalumi!G14),Būvkalumi!C14,\"\")","v":""},{"$f":"IF(ISNUMBER(Būvkalumi!G14),Būvkalumi!E14,\"\")","v":""},{"$f":"IF(ISNUMBER(Būvkalumi!G14),Būvkalumi!G14,\"\")","v":""},{"$f":"IF(ISNUMBER(Būvkalumi!G14),Būvkalumi!H14,\"\")","v":""},{"$f":"IF(ISTEXT(Būvkalumi!I14),Būvkalumi!I14,\"\")","v":""},""]
[{"$f":"IF(ISNUMBER(Būvkalumi!G15),Būvkalumi!A15,\"\")","v":""},{"$f":"IF(ISNUMBER(Būvkalumi!G15),Būvkalumi!B15,\"\")","v":""},{"$f":"IF(ISNUMBER(Būvkalumi!G15),Būvkalumi!C15,\"\")","v":""},{"$f":"IF(ISNUMBER(Būvkalumi!G15),Būvkalumi!E15,\"\")","v":""},{"$f":"IF(ISNUMBER(Būvkalumi!G15),Būvkalumi!G15,\"\")","v":""},{"$f":"IF(ISNUMBER(Būvkalumi!G15),Būvkalumi!H15,\"\")","v":""},{"$f":"IF(ISTEXT(Būvkalumi!I15),Būvkalumi!I15,\"\")","v":""},""]
[{"$f":"IF(ISNUMBER(Būvkalumi!G16),Būvkalumi!A16,\"\")","v":""},{"$f":"IF(ISNUMBER(Būvkalumi!G16),Būvkalumi!B16,\"\")","v":""},{"$f":"IF(ISNUMBER(Būvkalumi!G16),Būvkalumi!C16,\"\")","v":""},{"$f":"IF(ISNUMBER(Būvkalumi!G16),Būvkalumi!E16,\"\")","v":""},{"$f":"IF(ISNUMBER(Būvkalumi!G16),Būvkalumi!G16,\"\")","v":""},{"$f":"IF(ISNUMBER(Būvkalumi!G16),Būvkalumi!H16,\"\")","v":""},{"$f":"IF(ISTEXT(Būvkalumi!I16),Būvkalumi!I16,\"\")","v":""},""]
[{"$f":"IF(ISNUMBER(Būvkalumi!G17),Būvkalumi!A17,\"\")","v":""},{"$f":"IF(ISNUMBER(Būvkalumi!G17),Būvkalumi!B17,\"\")","v":""},{"$f":"IF(ISNUMBER(Būvkalumi!G17),Būvkalumi!C17,\"\")","v":""},{"$f":"IF(ISNUMBER(Būvkalumi!G17),Būvkalumi!E17,\"\")","v":""},{"$f":"IF(ISNUMBER(Būvkalumi!G17),Būvkalumi!G17,\"\")","v":""},{"$f":"IF(ISNUMBER(Būvkalumi!G17),Būvkalumi!H17,\"\")","v":""},{"$f":"IF(ISTEXT(Būvkalumi!I17),Būvkalumi!I17,\"\")","v":""},""]
[{"$f":"IF(ISNUMBER(Būvkalumi!G18),Būvkalumi!A18,\"\")","v":""},{"$f":"IF(ISNUMBER(Būvkalumi!G18),Būvkalumi!B18,\"\")","v":""},{"$f":"IF(ISNUMBER(Būvkalumi!G18),Būvkalumi!C18,\"\")","v":""},{"$f":"IF(ISNUMBER(Būvkalumi!G18),Būvkalumi!E18,\"\")","v":""},{"$f":"IF(ISNUMBER(Būvkalumi!G18),Būvkalumi!G18,\"\")","v":""},{"$f":"IF(ISNUMBER(Būvkalumi!G18),Būvkalumi!H18,\"\")","v":""},{"$f":"IF(ISTEXT(Būvkalumi!I18),Būvkalumi!I18,\"\")","v":""},""]
[{"$f":"IF(ISNUMBER(Būvkalumi!G19),Būvkalumi!A19,\"\")","v":""},{"$f":"IF(ISNUMBER(Būvkalumi!G19),Būvkalumi!B19,\"\")","v":""},{"$f":"IF(ISNUMBER(Būvkalumi!G19),Būvkalumi!C19,\"\")","v":""},{"$f":"IF(ISNUMBER(Būvkalumi!G19),Būvkalumi!E19,\"\")","v":""},{"$f":"IF(ISNUMBER(Būvkalumi!G19),Būvkalumi!G19,\"\")","v":""},{"$f":"IF(ISNUMBER(Būvkalumi!G19),Būvkalumi!H19,\"\")","v":""},{"$f":"IF(ISTEXT(Būvkalumi!I19),Būvkalumi!I19,\"\")","v":""},""]
[{"$f":"IF(ISNUMBER(Būvkalumi!G20),Būvkalumi!A20,\"\")","v":""},{"$f":"IF(ISNUMBER(Būvkalumi!G20),Būvkalumi!B20,\"\")","v":""},{"$f":"IF(ISNUMBER(Būvkalumi!G20),Būvkalumi!C20,\"\")","v":""},{"$f":"IF(ISNUMBER(Būvkalumi!G20),Būvkalumi!E20,\"\")","v":""},{"$f":"IF(ISNUMBER(Būvkalumi!G20),Būvkalumi!G20,\"\")","v":""},{"$f":"IF(ISNUMBER(Būvkalumi!G20),Būvkalumi!H20,\"\")","v":""},{"$f":"IF(ISTEXT(Būvkalumi!I20),Būvkalumi!I20,\"\")","v":""},""]
[{"$f":"IF(ISNUMBER(Būvkalumi!G21),Būvkalumi!A21,\"\")","v":""},{"$f":"IF(ISNUMBER(Būvkalumi!G21),Būvkalumi!B21,\"\")","v":""},{"$f":"IF(ISNUMBER(Būvkalumi!G21),Būvkalumi!C21,\"\")","v":""},{"$f":"IF(ISNUMBER(Būvkalumi!G21),Būvkalumi!E21,\"\")","v":""},{"$f":"IF(ISNUMBER(Būvkalumi!G21),Būvkalumi!G21,\"\")","v":""},{"$f":"IF(ISNUMBER(Būvkalumi!G21),Būvkalumi!H21,\"\")","v":""},{"$f":"IF(ISTEXT(Būvkalumi!I21),Būvkalumi!I21,\"\")","v":""},""]
[{"$f":"IF(ISNUMBER(Būvkalumi!G22),Būvkalumi!A22,\"\")","v":""},{"$f":"IF(ISNUMBER(Būvkalumi!G22),Būvkalumi!B22,\"\")","v":""},{"$f":"IF(ISNUMBER(Būvkalumi!G22),Būvkalumi!C22,\"\")","v":""},{"$f":"IF(ISNUMBER(Būvkalumi!G22),Būvkalumi!E22,\"\")","v":""},{"$f":"IF(ISNUMBER(Būvkalumi!G22),Būvkalumi!G22,\"\")","v":""},{"$f":"IF(ISNUMBER(Būvkalumi!G22),Būvkalumi!H22,\"\")","v":""},{"$f":"IF(ISTEXT(Būvkalumi!I22),Būvkalumi!I22,\"\")","v":""},""]
[{"$f":"IF(ISNUMBER(Būvkalumi!G23),Būvkalumi!A23,\"\")","v":""},{"$f":"IF(ISNUMBER(Būvkalumi!G23),Būvkalumi!B23,\"\")","v":""},{"$f":"IF(ISNUMBER(Būvkalumi!G23),Būvkalumi!C23,\"\")","v":""},{"$f":"IF(ISNUMBER(Būvkalumi!G23),Būvkalumi!E23,\"\")","v":""},{"$f":"IF(ISNUMBER(Būvkalumi!G23),Būvkalumi!G23,\"\")","v":""},{"$f":"IF(ISNUMBER(Būvkalumi!G23),Būvkalumi!H23,\"\")","v":""},{"$f":"IF(ISTEXT(Būvkalumi!I23),Būvkalumi!I23,\"\")","v":""},""]
[{"$f":"IF(ISNUMBER(Būvkalumi!G24),Būvkalumi!A24,\"\")","v":""},{"$f":"IF(ISNUMBER(Būvkalumi!G24),Būvkalumi!B24,\"\")","v":""},{"$f":"IF(ISNUMBER(Būvkalumi!G24),Būvkalumi!C24,\"\")","v":""},{"$f":"IF(ISNUMBER(Būvkalumi!G24),Būvkalumi!E24,\"\")","v":""},{"$f":"IF(ISNUMBER(Būvkalumi!G24),Būvkalumi!G24,\"\")","v":""},{"$f":"IF(ISNUMBER(Būvkalumi!G24),Būvkalumi!H24,\"\")","v":""},{"$f":"IF(ISTEXT(Būvkalumi!I24),Būvkalumi!I24,\"\")","v":""},""]
[{"$f":"IF(ISNUMBER(Būvkalumi!G25),Būvkalumi!A25,\"\")","v":""},{"$f":"IF(ISNUMBER(Būvkalumi!G25),Būvkalumi!B25,\"\")","v":""},{"$f":"IF(ISNUMBER(Būvkalumi!G25),Būvkalumi!C25,\"\")","v":""},{"$f":"IF(ISNUMBER(Būvkalumi!G25),Būvkalumi!E25,\"\")","v":""},{"$f":"IF(ISNUMBER(Būvkalumi!G25),Būvkalumi!G25,\"\")","v":""},{"$f":"IF(ISNUMBER(Būvkalumi!G25),Būvkalumi!H25,\"\")","v":""},{"$f":"IF(ISTEXT(Būvkalumi!I25),Būvkalumi!I25,\"\")","v":""},""]
[{"$f":"IF(ISNUMBER(Būvkalumi!G26),Būvkalumi!A26,\"\")","v":""},{"$f":"IF(ISNUMBER(Būvkalumi!G26),Būvkalumi!B26,\"\")","v":""},{"$f":"IF(ISNUMBER(Būvkalumi!G26),Būvkalumi!C26,\"\")","v":""},{"$f":"IF(ISNUMBER(Būvkalumi!G26),Būvkalumi!E26,\"\")","v":""},{"$f":"IF(ISNUMBER(Būvkalumi!G26),Būvkalumi!G26,\"\")","v":""},{"$f":"IF(ISNUMBER(Būvkalumi!G26),Būvkalumi!H26,\"\")","v":""},{"$f":"IF(ISTEXT(Būvkalumi!I26),Būvkalumi!I26,\"\")","v":""},""]
[{"$f":"IF(ISNUMBER(Būvkalumi!G27),Būvkalumi!A27,\"\")","v":""},{"$f":"IF(ISNUMBER(Būvkalumi!G27),Būvkalumi!B27,\"\")","v":""},{"$f":"IF(ISNUMBER(Būvkalumi!G27),Būvkalumi!C27,\"\")","v":""},{"$f":"IF(ISNUMBER(Būvkalumi!G27),Būvkalumi!E27,\"\")","v":""},{"$f":"IF(ISNUMBER(Būvkalumi!G27),Būvkalumi!G27,\"\")","v":""},{"$f":"IF(ISNUMBER(Būvkalumi!G27),Būvkalumi!H27,\"\")","v":""},{"$f":"IF(ISTEXT(Būvkalumi!I27),Būvkalumi!I27,\"\")","v":""},""]
[{"$f":"IF(ISNUMBER(Būvkalumi!G28),Būvkalumi!A28,\"\")","v":""},{"$f":"IF(ISNUMBER(Būvkalumi!G28),Būvkalumi!B28,\"\")","v":""},{"$f":"IF(ISNUMBER(Būvkalumi!G28),Būvkalumi!C28,\"\")","v":""},{"$f":"IF(ISNUMBER(Būvkalumi!G28),Būvkalumi!E28,\"\")","v":""},{"$f":"IF(ISNUMBER(Būvkalumi!G28),Būvkalumi!G28,\"\")","v":""},{"$f":"IF(ISNUMBER(Būvkalumi!G28),Būvkalumi!H28,\"\")","v":""},{"$f":"IF(ISTEXT(Būvkalumi!I28),Būvkalumi!I28,\"\")","v":""},""]
[{"$f":"IF(ISNUMBER(Būvkalumi!G29),Būvkalumi!A29,\"\")","v":""},{"$f":"IF(ISNUMBER(Būvkalumi!G29),Būvkalumi!B29,\"\")","v":""},{"$f":"IF(ISNUMBER(Būvkalumi!G29),Būvkalumi!C29,\"\")","v":""},{"$f":"IF(ISNUMBER(Būvkalumi!G29),Būvkalumi!E29,\"\")","v":""},{"$f":"IF(ISNUMBER(Būvkalumi!G29),Būvkalumi!G29,\"\")","v":""},{"$f":"IF(ISNUMBER(Būvkalumi!G29),Būvkalumi!H29,\"\")","v":""},{"$f":"IF(ISTEXT(Būvkalumi!I29),Būvkalumi!I29,\"\")","v":""},""]
[{"$f":"IF(ISNUMBER(Būvkalumi!G30),Būvkalumi!A30,\"\")","v":""},{"$f":"IF(ISNUMBER(Būvkalumi!G30),Būvkalumi!B30,\"\")","v":""},{"$f":"IF(ISNUMBER(Būvkalumi!G30),Būvkalumi!C30,\"\")","v":""},{"$f":"IF(ISNUMBER(Būvkalumi!G30),Būvkalumi!E30,\"\")","v":""},{"$f":"IF(ISNUMBER(Būvkalumi!G30),Būvkalumi!G30,\"\")","v":""},{"$f":"IF(ISNUMBER(Būvkalumi!G30),Būvkalumi!H30,\"\")","v":""},{"$f":"IF(ISTEXT(Būvkalumi!I30),Būvkalumi!I30,\"\")","v":""},""]
[{"$f":"IF(ISNUMBER(Būvkalumi!G31),Būvkalumi!A31,\"\")","v":""},{"$f":"IF(ISNUMBER(Būvkalumi!G31),Būvkalumi!B31,\"\")","v":""},{"$f":"IF(ISNUMBER(Būvkalumi!G31),Būvkalumi!C31,\"\")","v":""},{"$f":"IF(ISNUMBER(Būvkalumi!G31),Būvkalumi!E31,\"\")","v":""},{"$f":"IF(ISNUMBER(Būvkalumi!G31),Būvkalumi!G31,\"\")","v":""},{"$f":"IF(ISNUMBER(Būvkalumi!G31),Būvkalumi!H31,\"\")","v":""},{"$f":"IF(ISTEXT(Būvkalumi!I31),Būvkalumi!I31,\"\")","v":""},""]
[{"$f":"IF(ISNUMBER(Būvkalumi!G32),Būvkalumi!A32,\"\")","v":""},{"$f":"IF(ISNUMBER(Būvkalumi!G32),Būvkalumi!B32,\"\")","v":""},{"$f":"IF(ISNUMBER(Būvkalumi!G32),Būvkalumi!C32,\"\")","v":""},{"$f":"IF(ISNUMBER(Būvkalumi!G32),Būvkalumi!E32,\"\")","v":""},{"$f":"IF(ISNUMBER(Būvkalumi!G32),Būvkalumi!G32,\"\")","v":""},{"$f":"IF(ISNUMBER(Būvkalumi!G32),Būvkalumi!H32,\"\")","v":""},{"$f":"IF(ISTEXT(Būvkalumi!I32),Būvkalumi!I32,\"\")","v":""},""]
[{"$f":"IF(ISNUMBER(Būvkalumi!G33),Būvkalumi!A33,\"\")","v":""},{"$f":"IF(ISNUMBER(Būvkalumi!G33),Būvkalumi!B33,\"\")","v":""},{"$f":"IF(ISNUMBER(Būvkalumi!G33),Būvkalumi!C33,\"\")","v":""},{"$f":"IF(ISNUMBER(Būvkalumi!G33),Būvkalumi!E33,\"\")","v":""},{"$f":"IF(ISNUMBER(Būvkalumi!G33),Būvkalumi!G33,\"\")","v":""},{"$f":"IF(ISNUMBER(Būvkalumi!G33),Būvkalumi!H33,\"\")","v":""},{"$f":"IF(ISTEXT(Būvkalumi!I33),Būvkalumi!I33,\"\")","v":""},""]
[{"$f":"IF(ISNUMBER(Būvkalumi!G34),Būvkalumi!A34,\"\")","v":""},{"$f":"IF(ISNUMBER(Būvkalumi!G34),Būvkalumi!B34,\"\")","v":""},{"$f":"IF(ISNUMBER(Būvkalumi!G34),Būvkalumi!C34,\"\")","v":""},{"$f":"IF(ISNUMBER(Būvkalumi!G34),Būvkalumi!E34,\"\")","v":""},{"$f":"IF(ISNUMBER(Būvkalumi!G34),Būvkalumi!G34,\"\")","v":""},{"$f":"IF(ISNUMBER(Būvkalumi!G34),Būvkalumi!H34,\"\")","v":""},{"$f":"IF(ISTEXT(Būvkalumi!I34),Būvkalumi!I34,\"\")","v":""},""]
[{"$f":"IF(ISNUMBER(Būvkalumi!G35),Būvkalumi!A35,\"\")","v":""},{"$f":"IF(ISNUMBER(Būvkalumi!G35),Būvkalumi!B35,\"\")","v":""},{"$f":"IF(ISNUMBER(Būvkalumi!G35),Būvkalumi!C35,\"\")","v":""},{"$f":"IF(ISNUMBER(Būvkalumi!G35),Būvkalumi!E35,\"\")","v":""},{"$f":"IF(ISNUMBER(Būvkalumi!G35),Būvkalumi!G35,\"\")","v":""},{"$f":"IF(ISNUMBER(Būvkalumi!G35),Būvkalumi!H35,\"\")","v":""},{"$f":"IF(ISTEXT(Būvkalumi!I35),Būvkalumi!I35,\"\")","v":""},""]
[{"$f":"IF(ISNUMBER(Būvkalumi!G36),Būvkalumi!A36,\"\")","v":""},{"$f":"IF(ISNUMBER(Būvkalumi!G36),Būvkalumi!B36,\"\")","v":""},{"$f":"IF(ISNUMBER(Būvkalumi!G36),Būvkalumi!C36,\"\")","v":""},{"$f":"IF(ISNUMBER(Būvkalumi!G36),Būvkalumi!E36,\"\")","v":""},{"$f":"IF(ISNUMBER(Būvkalumi!G36),Būvkalumi!G36,\"\")","v":""},{"$f":"IF(ISNUMBER(Būvkalumi!G36),Būvkalumi!H36,\"\")","v":""},{"$f":"IF(ISTEXT(Būvkalumi!I36),Būvkalumi!I36,\"\")","v":""},""]
[{"$f":"IF(ISNUMBER(Būvkalumi!G37),Būvkalumi!A37,\"\")","v":""},{"$f":"IF(ISNUMBER(Būvkalumi!G37),Būvkalumi!B37,\"\")","v":""},{"$f":"IF(ISNUMBER(Būvkalumi!G37),Būvkalumi!C37,\"\")","v":""},{"$f":"IF(ISNUMBER(Būvkalumi!G37),Būvkalumi!E37,\"\")","v":""},{"$f":"IF(ISNUMBER(Būvkalumi!G37),Būvkalumi!G37,\"\")","v":""},{"$f":"IF(ISNUMBER(Būvkalumi!G37),Būvkalumi!H37,\"\")","v":""},{"$f":"IF(ISTEXT(Būvkalumi!I37),Būvkalumi!I37,\"\")","v":""},""]
[{"$f":"IF(ISNUMBER(Būvkalumi!G38),Būvkalumi!A38,\"\")","v":""},{"$f":"IF(ISNUMBER(Būvkalumi!G38),Būvkalumi!B38,\"\")","v":""},{"$f":"IF(ISNUMBER(Būvkalumi!G38),Būvkalumi!C38,\"\")","v":""},{"$f":"IF(ISNUMBER(Būvkalumi!G38),Būvkalumi!E38,\"\")","v":""},{"$f":"IF(ISNUMBER(Būvkalumi!G38),Būvkalumi!G38,\"\")","v":""},{"$f":"IF(ISNUMBER(Būvkalumi!G38),Būvkalumi!H38,\"\")","v":""},{"$f":"IF(ISTEXT(Būvkalumi!I38),Būvkalumi!I38,\"\")","v":""},""]
[{"$f":"IF(ISNUMBER(Būvkalumi!G39),Būvkalumi!A39,\"\")","v":""},{"$f":"IF(ISNUMBER(Būvkalumi!G39),Būvkalumi!B39,\"\")","v":""},{"$f":"IF(ISNUMBER(Būvkalumi!G39),Būvkalumi!C39,\"\")","v":""},{"$f":"IF(ISNUMBER(Būvkalumi!G39),Būvkalumi!E39,\"\")","v":""},{"$f":"IF(ISNUMBER(Būvkalumi!G39),Būvkalumi!G39,\"\")","v":""},{"$f":"IF(ISNUMBER(Būvkalumi!G39),Būvkalumi!H39,\"\")","v":""},{"$f":"IF(ISTEXT(Būvkalumi!I39),Būvkalumi!I39,\"\")","v":""},""]
[{"$f":"IF(ISNUMBER(Būvkalumi!G40),Būvkalumi!A40,\"\")","v":""},{"$f":"IF(ISNUMBER(Būvkalumi!G40),Būvkalumi!B40,\"\")","v":""},{"$f":"IF(ISNUMBER(Būvkalumi!G40),Būvkalumi!C40,\"\")","v":""},{"$f":"IF(ISNUMBER(Būvkalumi!G40),Būvkalumi!E40,\"\")","v":""},{"$f":"IF(ISNUMBER(Būvkalumi!G40),Būvkalumi!G40,\"\")","v":""},{"$f":"IF(ISNUMBER(Būvkalumi!G40),Būvkalumi!H40,\"\")","v":""},{"$f":"IF(ISTEXT(Būvkalumi!I40),Būvkalumi!I40,\"\")","v":""},""]
[{"$f":"IF(ISNUMBER(Būvkalumi!G41),Būvkalumi!A41,\"\")","v":""},{"$f":"IF(ISNUMBER(Būvkalumi!G41),Būvkalumi!B41,\"\")","v":""},{"$f":"IF(ISNUMBER(Būvkalumi!G41),Būvkalumi!C41,\"\")","v":""},{"$f":"IF(ISNUMBER(Būvkalumi!G41),Būvkalumi!E41,\"\")","v":""},{"$f":"IF(ISNUMBER(Būvkalumi!G41),Būvkalumi!G41,\"\")","v":""},{"$f":"IF(ISNUMBER(Būvkalumi!G41),Būvkalumi!H41,\"\")","v":""},{"$f":"IF(ISTEXT(Būvkalumi!I41),Būvkalumi!I41,\"\")","v":""},""]
[{"$f":"IF(ISNUMBER(Būvkalumi!G42),Būvkalumi!A42,\"\")","v":""},{"$f":"IF(ISNUMBER(Būvkalumi!G42),Būvkalumi!B42,\"\")","v":""},{"$f":"IF(ISNUMBER(Būvkalumi!G42),Būvkalumi!C42,\"\")","v":""},{"$f":"IF(ISNUMBER(Būvkalumi!G42),Būvkalumi!E42,\"\")","v":""},{"$f":"IF(ISNUMBER(Būvkalumi!G42),Būvkalumi!G42,\"\")","v":""},{"$f":"IF(ISNUMBER(Būvkalumi!G42),Būvkalumi!H42,\"\")","v":""},{"$f":"IF(ISTEXT(Būvkalumi!I42),Būvkalumi!I42,\"\")","v":""},""]
[{"$f":"IF(ISNUMBER(Būvkalumi!G43),Būvkalumi!A43,\"\")","v":""},{"$f":"IF(ISNUMBER(Būvkalumi!G43),Būvkalumi!B43,\"\")","v":""},{"$f":"IF(ISNUMBER(Būvkalumi!G43),Būvkalumi!C43,\"\")","v":""},{"$f":"IF(ISNUMBER(Būvkalumi!G43),Būvkalumi!E43,\"\")","v":""},{"$f":"IF(ISNUMBER(Būvkalumi!G43),Būvkalumi!G43,\"\")","v":""},{"$f":"IF(ISNUMBER(Būvkalumi!G43),Būvkalumi!H43,\"\")","v":""},{"$f":"IF(ISTEXT(Būvkalumi!I43),Būvkalumi!I43,\"\")","v":""},""]
[{"$f":"IF(ISNUMBER(Būvkalumi!G44),Būvkalumi!A44,\"\")","v":""},{"$f":"IF(ISNUMBER(Būvkalumi!G44),Būvkalumi!B44,\"\")","v":""},{"$f":"IF(ISNUMBER(Būvkalumi!G44),Būvkalumi!C44,\"\")","v":""},{"$f":"IF(ISNUMBER(Būvkalumi!G44),Būvkalumi!E44,\"\")","v":""},{"$f":"IF(ISNUMBER(Būvkalumi!G44),Būvkalumi!G44,\"\")","v":""},{"$f":"IF(ISNUMBER(Būvkalumi!G44),Būvkalumi!H44,\"\")","v":""},{"$f":"IF(ISTEXT(Būvkalumi!I44),Būvkalumi!I44,\"\")","v":""},""]
[{"$f":"IF(ISNUMBER(Būvkalumi!G45),Būvkalumi!A45,\"\")","v":""},{"$f":"IF(ISNUMBER(Būvkalumi!G45),Būvkalumi!B45,\"\")","v":""},{"$f":"IF(ISNUMBER(Būvkalumi!G45),Būvkalumi!C45,\"\")","v":""},{"$f":"IF(ISNUMBER(Būvkalumi!G45),Būvkalumi!E45,\"\")","v":""},{"$f":"IF(ISNUMBER(Būvkalumi!G45),Būvkalumi!G45,\"\")","v":""},{"$f":"IF(ISNUMBER(Būvkalumi!G45),Būvkalumi!H45,\"\")","v":""},{"$f":"IF(ISTEXT(Būvkalumi!I45),Būvkalumi!I45,\"\")","v":""},""]
[{"$f":"IF(ISNUMBER(Būvkalumi!G46),Būvkalumi!A46,\"\")","v":""},{"$f":"IF(ISNUMBER(Būvkalumi!G46),Būvkalumi!B46,\"\")","v":""},{"$f":"IF(ISNUMBER(Būvkalumi!G46),Būvkalumi!C46,\"\")","v":""},{"$f":"IF(ISNUMBER(Būvkalumi!G46),Būvkalumi!E46,\"\")","v":""},{"$f":"IF(ISNUMBER(Būvkalumi!G46),Būvkalumi!G46,\"\")","v":""},{"$f":"IF(ISNUMBER(Būvkalumi!G46),Būvkalumi!H46,\"\")","v":""},{"$f":"IF(ISTEXT(Būvkalumi!I46),Būvkalumi!I46,\"\")","v":""},""]
[{"$f":"IF(ISNUMBER(Būvkalumi!G47),Būvkalumi!A47,\"\")","v":""},{"$f":"IF(ISNUMBER(Būvkalumi!G47),Būvkalumi!B47,\"\")","v":""},{"$f":"IF(ISNUMBER(Būvkalumi!G47),Būvkalumi!C47,\"\")","v":""},{"$f":"IF(ISNUMBER(Būvkalumi!G47),Būvkalumi!E47,\"\")","v":""},{"$f":"IF(ISNUMBER(Būvkalumi!G47),Būvkalumi!G47,\"\")","v":""},{"$f":"IF(ISNUMBER(Būvkalumi!G47),Būvkalumi!H47,\"\")","v":""},{"$f":"IF(ISTEXT(Būvkalumi!I47),Būvkalumi!I47,\"\")","v":""},""]
[{"$f":"IF(ISNUMBER(Būvkalumi!G48),Būvkalumi!A48,\"\")","v":""},{"$f":"IF(ISNUMBER(Būvkalumi!G48),Būvkalumi!B48,\"\")","v":""},{"$f":"IF(ISNUMBER(Būvkalumi!G48),Būvkalumi!C48,\"\")","v":""},{"$f":"IF(ISNUMBER(Būvkalumi!G48),Būvkalumi!E48,\"\")","v":""},{"$f":"IF(ISNUMBER(Būvkalumi!G48),Būvkalumi!G48,\"\")","v":""},{"$f":"IF(ISNUMBER(Būvkalumi!G48),Būvkalumi!H48,\"\")","v":""},{"$f":"IF(ISTEXT(Būvkalumi!I48),Būvkalumi!I48,\"\")","v":""},""]
[{"$f":"IF(ISNUMBER(Būvkalumi!G49),Būvkalumi!A49,\"\")","v":""},{"$f":"IF(ISNUMBER(Būvkalumi!G49),Būvkalumi!B49,\"\")","v":""},{"$f":"IF(ISNUMBER(Būvkalumi!G49),Būvkalumi!C49,\"\")","v":""},{"$f":"IF(ISNUMBER(Būvkalumi!G49),Būvkalumi!E49,\"\")","v":""},{"$f":"IF(ISNUMBER(Būvkalumi!G49),Būvkalumi!G49,\"\")","v":""},{"$f":"IF(ISNUMBER(Būvkalumi!G49),Būvkalumi!H49,\"\")","v":""},{"$f":"IF(ISTEXT(Būvkalumi!I49),Būvkalumi!I49,\"\")","v":""},""]
[{"$f":"IF(ISNUMBER(Būvkalumi!G50),Būvkalumi!A50,\"\")","v":""},{"$f":"IF(ISNUMBER(Būvkalumi!G50),Būvkalumi!B50,\"\")","v":""},{"$f":"IF(ISNUMBER(Būvkalumi!G50),Būvkalumi!C50,\"\")","v":""},{"$f":"IF(ISNUMBER(Būvkalumi!G50),Būvkalumi!E50,\"\")","v":""},{"$f":"IF(ISNUMBER(Būvkalumi!G50),Būvkalumi!G50,\"\")","v":""},{"$f":"IF(ISNUMBER(Būvkalumi!G50),Būvkalumi!H50,\"\")","v":""},{"$f":"IF(ISTEXT(Būvkalumi!I50),Būvkalumi!I50,\"\")","v":""},""]
[{"$f":"IF(ISNUMBER(Būvkalumi!G51),Būvkalumi!A51,\"\")","v":""},{"$f":"IF(ISNUMBER(Būvkalumi!G51),Būvkalumi!B51,\"\")","v":""},{"$f":"IF(ISNUMBER(Būvkalumi!G51),Būvkalumi!C51,\"\")","v":""},{"$f":"IF(ISNUMBER(Būvkalumi!G51),Būvkalumi!E51,\"\")","v":""},{"$f":"IF(ISNUMBER(Būvkalumi!G51),Būvkalumi!G51,\"\")","v":""},{"$f":"IF(ISNUMBER(Būvkalumi!G51),Būvkalumi!H51,\"\")","v":""},{"$f":"IF(ISTEXT(Būvkalumi!I51),Būvkalumi!I51,\"\")","v":""},""]
[{"$f":"IF(ISNUMBER(Būvkalumi!G52),Būvkalumi!A52,\"\")","v":""},{"$f":"IF(ISNUMBER(Būvkalumi!G52),Būvkalumi!B52,\"\")","v":""},{"$f":"IF(ISNUMBER(Būvkalumi!G52),Būvkalumi!C52,\"\")","v":""},{"$f":"IF(ISNUMBER(Būvkalumi!G52),Būvkalumi!E52,\"\")","v":""},{"$f":"IF(ISNUMBER(Būvkalumi!G52),Būvkalumi!G52,\"\")","v":""},{"$f":"IF(ISNUMBER(Būvkalumi!G52),Būvkalumi!H52,\"\")","v":""},{"$f":"IF(ISTEXT(Būvkalumi!I52),Būvkalumi!I52,\"\")","v":""},""]
[{"$f":"IF(ISNUMBER(Būvkalumi!G53),Būvkalumi!A53,\"\")","v":""},{"$f":"IF(ISNUMBER(Būvkalumi!G53),Būvkalumi!B53,\"\")","v":""},{"$f":"IF(ISNUMBER(Būvkalumi!G53),Būvkalumi!C53,\"\")","v":""},{"$f":"IF(ISNUMBER(Būvkalumi!G53),Būvkalumi!E53,\"\")","v":""},{"$f":"IF(ISNUMBER(Būvkalumi!G53),Būvkalumi!G53,\"\")","v":""},{"$f":"IF(ISNUMBER(Būvkalumi!G53),Būvkalumi!H53,\"\")","v":""},{"$f":"IF(ISTEXT(Būvkalumi!I53),Būvkalumi!I53,\"\")","v":""},""]
[{"$f":"IF(ISNUMBER(Būvkalumi!G54),Būvkalumi!A54,\"\")","v":""},{"$f":"IF(ISNUMBER(Būvkalumi!G54),Būvkalumi!B54,\"\")","v":""},{"$f":"IF(ISNUMBER(Būvkalumi!G54),Būvkalumi!C54,\"\")","v":""},{"$f":"IF(ISNUMBER(Būvkalumi!G54),Būvkalumi!E54,\"\")","v":""},{"$f":"IF(ISNUMBER(Būvkalumi!G54),Būvkalumi!G54,\"\")","v":""},{"$f":"IF(ISNUMBER(Būvkalumi!G54),Būvkalumi!H54,\"\")","v":""},{"$f":"IF(ISTEXT(Būvkalumi!I54),Būvkalumi!I54,\"\")","v":""},""]
[{"$f":"IF(ISNUMBER(Būvkalumi!G55),Būvkalumi!A55,\"\")","v":""},{"$f":"IF(ISNUMBER(Būvkalumi!G55),Būvkalumi!B55,\"\")","v":""},{"$f":"IF(ISNUMBER(Būvkalumi!G55),Būvkalumi!C55,\"\")","v":""},{"$f":"IF(ISNUMBER(Būvkalumi!G55),Būvkalumi!E55,\"\")","v":""},{"$f":"IF(ISNUMBER(Būvkalumi!G55),Būvkalumi!G55,\"\")","v":""},{"$f":"IF(ISNUMBER(Būvkalumi!G55),Būvkalumi!H55,\"\")","v":""},{"$f":"IF(ISTEXT(Būvkalumi!I55),Būvkalumi!I55,\"\")","v":""},""]
[{"$f":"IF(ISNUMBER(Būvkalumi!G56),Būvkalumi!A56,\"\")","v":""},{"$f":"IF(ISNUMBER(Būvkalumi!G56),Būvkalumi!B56,\"\")","v":""},{"$f":"IF(ISNUMBER(Būvkalumi!G56),Būvkalumi!C56,\"\")","v":""},{"$f":"IF(ISNUMBER(Būvkalumi!G56),Būvkalumi!E56,\"\")","v":""},{"$f":"IF(ISNUMBER(Būvkalumi!G56),Būvkalumi!G56,\"\")","v":""},{"$f":"IF(ISNUMBER(Būvkalumi!G56),Būvkalumi!H56,\"\")","v":""},{"$f":"IF(ISTEXT(Būvkalumi!I56),Būvkalumi!I56,\"\")","v":""},""]
[{"$f":"IF(ISNUMBER(Būvkalumi!G57),Būvkalumi!A57,\"\")","v":""},{"$f":"IF(ISNUMBER(Būvkalumi!G57),Būvkalumi!B57,\"\")","v":""},{"$f":"IF(ISNUMBER(Būvkalumi!G57),Būvkalumi!C57,\"\")","v":""},{"$f":"IF(ISNUMBER(Būvkalumi!G57),Būvkalumi!E57,\"\")","v":""},{"$f":"IF(ISNUMBER(Būvkalumi!G57),Būvkalumi!G57,\"\")","v":""},{"$f":"IF(ISNUMBER(Būvkalumi!G57),Būvkalumi!H57,\"\")","v":""},{"$f":"IF(ISTEXT(Būvkalumi!I57),Būvkalumi!I57,\"\")","v":""},""]
[{"$f":"IF(ISNUMBER(Būvkalumi!G58),Būvkalumi!A58,\"\")","v":""},{"$f":"IF(ISNUMBER(Būvkalumi!G58),Būvkalumi!B58,\"\")","v":""},{"$f":"IF(ISNUMBER(Būvkalumi!G58),Būvkalumi!C58,\"\")","v":""},{"$f":"IF(ISNUMBER(Būvkalumi!G58),Būvkalumi!E58,\"\")","v":""},{"$f":"IF(ISNUMBER(Būvkalumi!G58),Būvkalumi!G58,\"\")","v":""},{"$f":"IF(ISNUMBER(Būvkalumi!G58),Būvkalumi!H58,\"\")","v":""},{"$f":"IF(ISTEXT(Būvkalumi!I58),Būvkalumi!I58,\"\")","v":""},""]
[{"$f":"IF(ISNUMBER(Būvkalumi!G59),Būvkalumi!A59,\"\")","v":""},{"$f":"IF(ISNUMBER(Būvkalumi!G59),Būvkalumi!B59,\"\")","v":""},{"$f":"IF(ISNUMBER(Būvkalumi!G59),Būvkalumi!C59,\"\")","v":""},{"$f":"IF(ISNUMBER(Būvkalumi!G59),Būvkalumi!E59,\"\")","v":""},{"$f":"IF(ISNUMBER(Būvkalumi!G59),Būvkalumi!G59,\"\")","v":""},{"$f":"IF(ISNUMBER(Būvkalumi!G59),Būvkalumi!H59,\"\")","v":""},{"$f":"IF(ISTEXT(Būvkalumi!I59),Būvkalumi!I59,\"\")","v":""},""]
[{"$f":"IF(ISNUMBER(Būvkalumi!G60),Būvkalumi!A60,\"\")","v":""},{"$f":"IF(ISNUMBER(Būvkalumi!G60),Būvkalumi!B60,\"\")","v":""},{"$f":"IF(ISNUMBER(Būvkalumi!G60),Būvkalumi!C60,\"\")","v":""},{"$f":"IF(ISNUMBER(Būvkalumi!G60),Būvkalumi!E60,\"\")","v":""},{"$f":"IF(ISNUMBER(Būvkalumi!G60),Būvkalumi!G60,\"\")","v":""},{"$f":"IF(ISNUMBER(Būvkalumi!G60),Būvkalumi!H60,\"\")","v":""},{"$f":"IF(ISTEXT(Būvkalumi!I60),Būvkalumi!I60,\"\")","v":""},""]
[{"$f":"IF(ISNUMBER(Būvkalumi!G61),Būvkalumi!A61,\"\")","v":""},{"$f":"IF(ISNUMBER(Būvkalumi!G61),Būvkalumi!B61,\"\")","v":""},{"$f":"IF(ISNUMBER(Būvkalumi!G61),Būvkalumi!C61,\"\")","v":""},{"$f":"IF(ISNUMBER(Būvkalumi!G61),Būvkalumi!E61,\"\")","v":""},{"$f":"IF(ISNUMBER(Būvkalumi!G61),Būvkalumi!G61,\"\")","v":""},{"$f":"IF(ISNUMBER(Būvkalumi!G61),Būvkalumi!H61,\"\")","v":""},{"$f":"IF(ISTEXT(Būvkalumi!I61),Būvkalumi!I61,\"\")","v":""},""]
[{"$f":"IF(ISNUMBER(Būvkalumi!G62),Būvkalumi!A62,\"\")","v":""},{"$f":"IF(ISNUMBER(Būvkalumi!G62),Būvkalumi!B62,\"\")","v":""},{"$f":"IF(ISNUMBER(Būvkalumi!G62),Būvkalumi!C62,\"\")","v":""},{"$f":"IF(ISNUMBER(Būvkalumi!G62),Būvkalumi!E62,\"\")","v":""},{"$f":"IF(ISNUMBER(Būvkalumi!G62),Būvkalumi!G62,\"\")","v":""},{"$f":"IF(ISNUMBER(Būvkalumi!G62),Būvkalumi!H62,\"\")","v":""},{"$f":"IF(ISTEXT(Būvkalumi!I62),Būvkalumi!I62,\"\")","v":""},""]
[{"$f":"IF(ISNUMBER(Būvkalumi!G63),Būvkalumi!A63,\"\")","v":""},{"$f":"IF(ISNUMBER(Būvkalumi!G63),Būvkalumi!B63,\"\")","v":""},{"$f":"IF(ISNUMBER(Būvkalumi!G63),Būvkalumi!C63,\"\")","v":""},{"$f":"IF(ISNUMBER(Būvkalumi!G63),Būvkalumi!E63,\"\")","v":""},{"$f":"IF(ISNUMBER(Būvkalumi!G63),Būvkalumi!G63,\"\")","v":""},{"$f":"IF(ISNUMBER(Būvkalumi!G63),Būvkalumi!H63,\"\")","v":""},{"$f":"IF(ISTEXT(Būvkalumi!I63),Būvkalumi!I63,\"\")","v":""},""]
[{"$f":"IF(ISNUMBER(Būvkalumi!G64),Būvkalumi!A64,\"\")","v":""},{"$f":"IF(ISNUMBER(Būvkalumi!G64),Būvkalumi!B64,\"\")","v":""},{"$f":"IF(ISNUMBER(Būvkalumi!G64),Būvkalumi!C64,\"\")","v":""},{"$f":"IF(ISNUMBER(Būvkalumi!G64),Būvkalumi!E64,\"\")","v":""},{"$f":"IF(ISNUMBER(Būvkalumi!G64),Būvkalumi!G64,\"\")","v":""},{"$f":"IF(ISNUMBER(Būvkalumi!G64),Būvkalumi!H64,\"\")","v":""},{"$f":"IF(ISTEXT(Būvkalumi!I64),Būvkalumi!I64,\"\")","v":""},""]
[{"$f":"IF(ISNUMBER(Būvkalumi!G65),Būvkalumi!A65,\"\")","v":""},{"$f":"IF(ISNUMBER(Būvkalumi!G65),Būvkalumi!B65,\"\")","v":""},{"$f":"IF(ISNUMBER(Būvkalumi!G65),Būvkalumi!C65,\"\")","v":""},{"$f":"IF(ISNUMBER(Būvkalumi!G65),Būvkalumi!E65,\"\")","v":""},{"$f":"IF(ISNUMBER(Būvkalumi!G65),Būvkalumi!G65,\"\")","v":""},{"$f":"IF(ISNUMBER(Būvkalumi!G65),Būvkalumi!H65,\"\")","v":""},{"$f":"IF(ISTEXT(Būvkalumi!I65),Būvkalumi!I65,\"\")","v":""},""]
[{"$f":"IF(ISNUMBER(Būvkalumi!G66),Būvkalumi!A66,\"\")","v":""},{"$f":"IF(ISNUMBER(Būvkalumi!G66),Būvkalumi!B66,\"\")","v":""},{"$f":"IF(ISNUMBER(Būvkalumi!G66),Būvkalumi!C66,\"\")","v":""},{"$f":"IF(ISNUMBER(Būvkalumi!G66),Būvkalumi!E66,\"\")","v":""},{"$f":"IF(ISNUMBER(Būvkalumi!G66),Būvkalumi!G66,\"\")","v":""},{"$f":"IF(ISNUMBER(Būvkalumi!G66),Būvkalumi!H66,\"\")","v":""},{"$f":"IF(ISTEXT(Būvkalumi!I66),Būvkalumi!I66,\"\")","v":""},""]
[{"$f":"IF(ISNUMBER(Būvkalumi!G67),Būvkalumi!A67,\"\")","v":""},{"$f":"IF(ISNUMBER(Būvkalumi!G67),Būvkalumi!B67,\"\")","v":""},{"$f":"IF(ISNUMBER(Būvkalumi!G67),Būvkalumi!C67,\"\")","v":""},{"$f":"IF(ISNUMBER(Būvkalumi!G67),Būvkalumi!E67,\"\")","v":""},{"$f":"IF(ISNUMBER(Būvkalumi!G67),Būvkalumi!G67,\"\")","v":""},{"$f":"IF(ISNUMBER(Būvkalumi!G67),Būvkalumi!H67,\"\")","v":""},{"$f":"IF(ISTEXT(Būvkalumi!I67),Būvkalumi!I67,\"\")","v":""},""]
[{"$f":"IF(ISNUMBER(Būvkalumi!G68),Būvkalumi!A68,\"\")","v":""},{"$f":"IF(ISNUMBER(Būvkalumi!G68),Būvkalumi!B68,\"\")","v":""},{"$f":"IF(ISNUMBER(Būvkalumi!G68),Būvkalumi!C68,\"\")","v":""},{"$f":"IF(ISNUMBER(Būvkalumi!G68),Būvkalumi!E68,\"\")","v":""},{"$f":"IF(ISNUMBER(Būvkalumi!G68),Būvkalumi!G68,\"\")","v":""},{"$f":"IF(ISNUMBER(Būvkalumi!G68),Būvkalumi!H68,\"\")","v":""},{"$f":"IF(ISTEXT(Būvkalumi!I68),Būvkalumi!I68,\"\")","v":""},""]
[{"$f":"IF(ISNUMBER(Būvkalumi!G69),Būvkalumi!A69,\"\")","v":""},{"$f":"IF(ISNUMBER(Būvkalumi!G69),Būvkalumi!B69,\"\")","v":""},{"$f":"IF(ISNUMBER(Būvkalumi!G69),Būvkalumi!C69,\"\")","v":""},{"$f":"IF(ISNUMBER(Būvkalumi!G69),Būvkalumi!E69,\"\")","v":""},{"$f":"IF(ISNUMBER(Būvkalumi!G69),Būvkalumi!G69,\"\")","v":""},{"$f":"IF(ISNUMBER(Būvkalumi!G69),Būvkalumi!H69,\"\")","v":""},{"$f":"IF(ISTEXT(Būvkalumi!I69),Būvkalumi!I69,\"\")","v":""},{"$f":"IF(ISNUMBER(E667),\"yes\",\"\")","v":""}]
[{"$f":"IF(ISNUMBER(Būvkalumi!G70),Būvkalumi!A70,\"\")","v":""},{"$f":"IF(ISNUMBER(Būvkalumi!G70),Būvkalumi!B70,\"\")","v":""},{"$f":"IF(ISNUMBER(Būvkalumi!G70),Būvkalumi!C70,\"\")","v":""},{"$f":"IF(ISNUMBER(Būvkalumi!G70),Būvkalumi!E70,\"\")","v":""},{"$f":"IF(ISNUMBER(Būvkalumi!G70),Būvkalumi!G70,\"\")","v":""},{"$f":"IF(ISNUMBER(Būvkalumi!G70),Būvkalumi!H70,\"\")","v":""},{"$f":"IF(ISTEXT(Būvkalumi!I70),Būvkalumi!I70,\"\")","v":""},""]
[{"$f":"IF(ISNUMBER(Būvkalumi!G71),Būvkalumi!A71,\"\")","v":""},{"$f":"IF(ISNUMBER(Būvkalumi!G71),Būvkalumi!B71,\"\")","v":""},{"$f":"IF(ISNUMBER(Būvkalumi!G71),Būvkalumi!C71,\"\")","v":""},{"$f":"IF(ISNUMBER(Būvkalumi!G71),Būvkalumi!E71,\"\")","v":""},{"$f":"IF(ISNUMBER(Būvkalumi!G71),Būvkalumi!G71,\"\")","v":""},{"$f":"IF(ISNUMBER(Būvkalumi!G71),Būvkalumi!H71,\"\")","v":""},{"$f":"IF(ISTEXT(Būvkalumi!I71),Būvkalumi!I71,\"\")","v":""},""]
[{"$f":"IF(ISNUMBER(Būvkalumi!G72),Būvkalumi!A72,\"\")","v":""},{"$f":"IF(ISNUMBER(Būvkalumi!G72),Būvkalumi!B72,\"\")","v":""},{"$f":"IF(ISNUMBER(Būvkalumi!G72),Būvkalumi!C72,\"\")","v":""},{"$f":"IF(ISNUMBER(Būvkalumi!G72),Būvkalumi!E72,\"\")","v":""},{"$f":"IF(ISNUMBER(Būvkalumi!G72),Būvkalumi!G72,\"\")","v":""},{"$f":"IF(ISNUMBER(Būvkalumi!G72),Būvkalumi!H72,\"\")","v":""},{"$f":"IF(ISTEXT(Būvkalumi!I72),Būvkalumi!I72,\"\")","v":""},""]
[{"$f":"IF(ISNUMBER(Būvkalumi!G73),Būvkalumi!A73,\"\")","v":""},{"$f":"IF(ISNUMBER(Būvkalumi!G73),Būvkalumi!B73,\"\")","v":""},{"$f":"IF(ISNUMBER(Būvkalumi!G73),Būvkalumi!C73,\"\")","v":""},{"$f":"IF(ISNUMBER(Būvkalumi!G73),Būvkalumi!E73,\"\")","v":""},{"$f":"IF(ISNUMBER(Būvkalumi!G73),Būvkalumi!G73,\"\")","v":""},{"$f":"IF(ISNUMBER(Būvkalumi!G73),Būvkalumi!H73,\"\")","v":""},{"$f":"IF(ISTEXT(Būvkalumi!I73),Būvkalumi!I73,\"\")","v":""},""]
[{"$f":"IF(ISNUMBER(Būvkalumi!G74),Būvkalumi!A74,\"\")","v":""},{"$f":"IF(ISNUMBER(Būvkalumi!G74),Būvkalumi!B74,\"\")","v":""},{"$f":"IF(ISNUMBER(Būvkalumi!G74),Būvkalumi!C74,\"\")","v":""},{"$f":"IF(ISNUMBER(Būvkalumi!G74),Būvkalumi!E74,\"\")","v":""},{"$f":"IF(ISNUMBER(Būvkalumi!G74),Būvkalumi!G74,\"\")","v":""},{"$f":"IF(ISNUMBER(Būvkalumi!G74),Būvkalumi!H74,\"\")","v":""},{"$f":"IF(ISTEXT(Būvkalumi!I74),Būvkalumi!I74,\"\")","v":""},""]
[{"$f":"IF(ISNUMBER(Būvkalumi!G75),Būvkalumi!A75,\"\")","v":""},{"$f":"IF(ISNUMBER(Būvkalumi!G75),Būvkalumi!B75,\"\")","v":""},{"$f":"IF(ISNUMBER(Būvkalumi!G75),Būvkalumi!C75,\"\")","v":""},{"$f":"IF(ISNUMBER(Būvkalumi!G75),Būvkalumi!E75,\"\")","v":""},{"$f":"IF(ISNUMBER(Būvkalumi!G75),Būvkalumi!G75,\"\")","v":""},{"$f":"IF(ISNUMBER(Būvkalumi!G75),Būvkalumi!H75,\"\")","v":""},{"$f":"IF(ISTEXT(Būvkalumi!I75),Būvkalumi!I75,\"\")","v":""},""]
[{"$f":"IF(ISNUMBER(Būvkalumi!G76),Būvkalumi!A76,\"\")","v":""},{"$f":"IF(ISNUMBER(Būvkalumi!G76),Būvkalumi!B76,\"\")","v":""},{"$f":"IF(ISNUMBER(Būvkalumi!G76),Būvkalumi!C76,\"\")","v":""},{"$f":"IF(ISNUMBER(Būvkalumi!G76),Būvkalumi!E76,\"\")","v":""},{"$f":"IF(ISNUMBER(Būvkalumi!G76),Būvkalumi!G76,\"\")","v":""},{"$f":"IF(ISNUMBER(Būvkalumi!G76),Būvkalumi!H76,\"\")","v":""},{"$f":"IF(ISTEXT(Būvkalumi!I76),Būvkalumi!I76,\"\")","v":""},""]
[{"$f":"IF(ISNUMBER(Būvkalumi!G77),Būvkalumi!A77,\"\")","v":""},{"$f":"IF(ISNUMBER(Būvkalumi!G77),Būvkalumi!B77,\"\")","v":""},{"$f":"IF(ISNUMBER(Būvkalumi!G77),Būvkalumi!C77,\"\")","v":""},{"$f":"IF(ISNUMBER(Būvkalumi!G77),Būvkalumi!E77,\"\")","v":""},{"$f":"IF(ISNUMBER(Būvkalumi!G77),Būvkalumi!G77,\"\")","v":""},{"$f":"IF(ISNUMBER(Būvkalumi!G77),Būvkalumi!H77,\"\")","v":""},{"$f":"IF(ISTEXT(Būvkalumi!I77),Būvkalumi!I77,\"\")","v":""},""]
[{"$f":"IF(ISNUMBER(Būvkalumi!G78),Būvkalumi!A78,\"\")","v":""},{"$f":"IF(ISNUMBER(Būvkalumi!G78),Būvkalumi!B78,\"\")","v":""},{"$f":"IF(ISNUMBER(Būvkalumi!G78),Būvkalumi!C78,\"\")","v":""},{"$f":"IF(ISNUMBER(Būvkalumi!G78),Būvkalumi!E78,\"\")","v":""},{"$f":"IF(ISNUMBER(Būvkalumi!G78),Būvkalumi!G78,\"\")","v":""},{"$f":"IF(ISNUMBER(Būvkalumi!G78),Būvkalumi!H78,\"\")","v":""},{"$f":"IF(ISTEXT(Būvkalumi!I78),Būvkalumi!I78,\"\")","v":""},""]
[{"$f":"IF(ISNUMBER(Būvkalumi!G79),Būvkalumi!A79,\"\")","v":""},{"$f":"IF(ISNUMBER(Būvkalumi!G79),Būvkalumi!B79,\"\")","v":""},{"$f":"IF(ISNUMBER(Būvkalumi!G79),Būvkalumi!C79,\"\")","v":""},{"$f":"IF(ISNUMBER(Būvkalumi!G79),Būvkalumi!E79,\"\")","v":""},{"$f":"IF(ISNUMBER(Būvkalumi!G79),Būvkalumi!G79,\"\")","v":""},{"$f":"IF(ISNUMBER(Būvkalumi!G79),Būvkalumi!H79,\"\")","v":""},{"$f":"IF(ISTEXT(Būvkalumi!I79),Būvkalumi!I79,\"\")","v":""},""]
[{"$f":"IF(ISNUMBER(Būvkalumi!G80),Būvkalumi!A80,\"\")","v":""},{"$f":"IF(ISNUMBER(Būvkalumi!G80),Būvkalumi!B80,\"\")","v":""},{"$f":"IF(ISNUMBER(Būvkalumi!G80),Būvkalumi!C80,\"\")","v":""},{"$f":"IF(ISNUMBER(Būvkalumi!G80),Būvkalumi!E80,\"\")","v":""},{"$f":"IF(ISNUMBER(Būvkalumi!G80),Būvkalumi!G80,\"\")","v":""},{"$f":"IF(ISNUMBER(Būvkalumi!G80),Būvkalumi!H80,\"\")","v":""},{"$f":"IF(ISTEXT(Būvkalumi!I80),Būvkalumi!I80,\"\")","v":""},""]
[{"$f":"IF(ISNUMBER(Būvkalumi!G81),Būvkalumi!A81,\"\")","v":""},{"$f":"IF(ISNUMBER(Būvkalumi!G81),Būvkalumi!B81,\"\")","v":""},{"$f":"IF(ISNUMBER(Būvkalumi!G81),Būvkalumi!C81,\"\")","v":""},{"$f":"IF(ISNUMBER(Būvkalumi!G81),Būvkalumi!E81,\"\")","v":""},{"$f":"IF(ISNUMBER(Būvkalumi!G81),Būvkalumi!G81,\"\")","v":""},{"$f":"IF(ISNUMBER(Būvkalumi!G81),Būvkalumi!H81,\"\")","v":""},{"$f":"IF(ISTEXT(Būvkalumi!I81),Būvkalumi!I81,\"\")","v":""},""]
[{"$f":"IF(ISNUMBER(Būvkalumi!G82),Būvkalumi!A82,\"\")","v":""},{"$f":"IF(ISNUMBER(Būvkalumi!G82),Būvkalumi!B82,\"\")","v":""},{"$f":"IF(ISNUMBER(Būvkalumi!G82),Būvkalumi!C82,\"\")","v":""},{"$f":"IF(ISNUMBER(Būvkalumi!G82),Būvkalumi!E82,\"\")","v":""},{"$f":"IF(ISNUMBER(Būvkalumi!G82),Būvkalumi!G82,\"\")","v":""},{"$f":"IF(ISNUMBER(Būvkalumi!G82),Būvkalumi!H82,\"\")","v":""},{"$f":"IF(ISTEXT(Būvkalumi!I82),Būvkalumi!I82,\"\")","v":""},""]
[{"$f":"IF(ISNUMBER(Būvkalumi!G83),Būvkalumi!A83,\"\")","v":""},{"$f":"IF(ISNUMBER(Būvkalumi!G83),Būvkalumi!B83,\"\")","v":""},{"$f":"IF(ISNUMBER(Būvkalumi!G83),Būvkalumi!C83,\"\")","v":""},{"$f":"IF(ISNUMBER(Būvkalumi!G83),Būvkalumi!E83,\"\")","v":""},{"$f":"IF(ISNUMBER(Būvkalumi!G83),Būvkalumi!G83,\"\")","v":""},{"$f":"IF(ISNUMBER(Būvkalumi!G83),Būvkalumi!H83,\"\")","v":""},{"$f":"IF(ISTEXT(Būvkalumi!I83),Būvkalumi!I83,\"\")","v":""},""]
[{"$f":"IF(ISNUMBER(Būvkalumi!G84),Būvkalumi!A84,\"\")","v":""},{"$f":"IF(ISNUMBER(Būvkalumi!G84),Būvkalumi!B84,\"\")","v":""},{"$f":"IF(ISNUMBER(Būvkalumi!G84),Būvkalumi!C84,\"\")","v":""},{"$f":"IF(ISNUMBER(Būvkalumi!G84),Būvkalumi!E84,\"\")","v":""},{"$f":"IF(ISNUMBER(Būvkalumi!G84),Būvkalumi!G84,\"\")","v":""},{"$f":"IF(ISNUMBER(Būvkalumi!G84),Būvkalumi!H84,\"\")","v":""},{"$f":"IF(ISTEXT(Būvkalumi!I84),Būvkalumi!I84,\"\")","v":""},""]
[{"$f":"IF(ISNUMBER(Būvkalumi!G85),Būvkalumi!A85,\"\")","v":""},{"$f":"IF(ISNUMBER(Būvkalumi!G85),Būvkalumi!B85,\"\")","v":""},{"$f":"IF(ISNUMBER(Būvkalumi!G85),Būvkalumi!C85,\"\")","v":""},{"$f":"IF(ISNUMBER(Būvkalumi!G85),Būvkalumi!E85,\"\")","v":""},{"$f":"IF(ISNUMBER(Būvkalumi!G85),Būvkalumi!G85,\"\")","v":""},{"$f":"IF(ISNUMBER(Būvkalumi!G85),Būvkalumi!H85,\"\")","v":""},{"$f":"IF(ISTEXT(Būvkalumi!I85),Būvkalumi!I85,\"\")","v":""},""]
[{"$f":"IF(ISNUMBER(Būvkalumi!G86),Būvkalumi!A86,\"\")","v":""},{"$f":"IF(ISNUMBER(Būvkalumi!G86),Būvkalumi!B86,\"\")","v":""},{"$f":"IF(ISNUMBER(Būvkalumi!G86),Būvkalumi!C86,\"\")","v":""},{"$f":"IF(ISNUMBER(Būvkalumi!G86),Būvkalumi!E86,\"\")","v":""},{"$f":"IF(ISNUMBER(Būvkalumi!G86),Būvkalumi!G86,\"\")","v":""},{"$f":"IF(ISNUMBER(Būvkalumi!G86),Būvkalumi!H86,\"\")","v":""},{"$f":"IF(ISTEXT(Būvkalumi!I86),Būvkalumi!I86,\"\")","v":""},""]
[{"$f":"IF(ISNUMBER(Būvkalumi!G87),Būvkalumi!A87,\"\")","v":""},{"$f":"IF(ISNUMBER(Būvkalumi!G87),Būvkalumi!B87,\"\")","v":""},{"$f":"IF(ISNUMBER(Būvkalumi!G87),Būvkalumi!C87,\"\")","v":""},{"$f":"IF(ISNUMBER(Būvkalumi!G87),Būvkalumi!E87,\"\")","v":""},{"$f":"IF(ISNUMBER(Būvkalumi!G87),Būvkalumi!G87,\"\")","v":""},{"$f":"IF(ISNUMBER(Būvkalumi!G87),Būvkalumi!H87,\"\")","v":""},{"$f":"IF(ISTEXT(Būvkalumi!I87),Būvkalumi!I87,\"\")","v":""},""]
[{"$f":"IF(ISNUMBER(Būvkalumi!G88),Būvkalumi!A88,\"\")","v":""},{"$f":"IF(ISNUMBER(Būvkalumi!G88),Būvkalumi!B88,\"\")","v":""},{"$f":"IF(ISNUMBER(Būvkalumi!G88),Būvkalumi!C88,\"\")","v":""},{"$f":"IF(ISNUMBER(Būvkalumi!G88),Būvkalumi!E88,\"\")","v":""},{"$f":"IF(ISNUMBER(Būvkalumi!G88),Būvkalumi!G88,\"\")","v":""},{"$f":"IF(ISNUMBER(Būvkalumi!G88),Būvkalumi!H88,\"\")","v":""},{"$f":"IF(ISTEXT(Būvkalumi!I88),Būvkalumi!I88,\"\")","v":""},""]
[{"$f":"IF(ISNUMBER(Būvkalumi!G89),Būvkalumi!A89,\"\")","v":""},{"$f":"IF(ISNUMBER(Būvkalumi!G89),Būvkalumi!B89,\"\")","v":""},{"$f":"IF(ISNUMBER(Būvkalumi!G89),Būvkalumi!C89,\"\")","v":""},{"$f":"IF(ISNUMBER(Būvkalumi!G89),Būvkalumi!E89,\"\")","v":""},{"$f":"IF(ISNUMBER(Būvkalumi!G89),Būvkalumi!G89,\"\")","v":""},{"$f":"IF(ISNUMBER(Būvkalumi!G89),Būvkalumi!H89,\"\")","v":""},{"$f":"IF(ISTEXT(Būvkalumi!I89),Būvkalumi!I89,\"\")","v":""},""]
[{"$f":"IF(ISNUMBER(Būvkalumi!G90),Būvkalumi!A90,\"\")","v":""},{"$f":"IF(ISNUMBER(Būvkalumi!G90),Būvkalumi!B90,\"\")","v":""},{"$f":"IF(ISNUMBER(Būvkalumi!G90),Būvkalumi!C90,\"\")","v":""},{"$f":"IF(ISNUMBER(Būvkalumi!G90),Būvkalumi!E90,\"\")","v":""},{"$f":"IF(ISNUMBER(Būvkalumi!G90),Būvkalumi!G90,\"\")","v":""},{"$f":"IF(ISNUMBER(Būvkalumi!G90),Būvkalumi!H90,\"\")","v":""},{"$f":"IF(ISTEXT(Būvkalumi!I90),Būvkalumi!I90,\"\")","v":""},""]
[{"$f":"IF(ISNUMBER(Būvkalumi!G91),Būvkalumi!A91,\"\")","v":""},{"$f":"IF(ISNUMBER(Būvkalumi!G91),Būvkalumi!B91,\"\")","v":""},{"$f":"IF(ISNUMBER(Būvkalumi!G91),Būvkalumi!C91,\"\")","v":""},{"$f":"IF(ISNUMBER(Būvkalumi!G91),Būvkalumi!E91,\"\")","v":""},{"$f":"IF(ISNUMBER(Būvkalumi!G91),Būvkalumi!G91,\"\")","v":""},{"$f":"IF(ISNUMBER(Būvkalumi!G91),Būvkalumi!H91,\"\")","v":""},{"$f":"IF(ISTEXT(Būvkalumi!I91),Būvkalumi!I91,\"\")","v":""},""]
[{"$f":"IF(ISNUMBER(Būvkalumi!G92),Būvkalumi!A92,\"\")","v":""},{"$f":"IF(ISNUMBER(Būvkalumi!G92),Būvkalumi!B92,\"\")","v":""},{"$f":"IF(ISNUMBER(Būvkalumi!G92),Būvkalumi!C92,\"\")","v":""},{"$f":"IF(ISNUMBER(Būvkalumi!G92),Būvkalumi!E92,\"\")","v":""},{"$f":"IF(ISNUMBER(Būvkalumi!G92),Būvkalumi!G92,\"\")","v":""},{"$f":"IF(ISNUMBER(Būvkalumi!G92),Būvkalumi!H92,\"\")","v":""},{"$f":"IF(ISTEXT(Būvkalumi!I92),Būvkalumi!I92,\"\")","v":""},""]
[{"$f":"IF(ISNUMBER(Būvkalumi!G93),Būvkalumi!A93,\"\")","v":""},{"$f":"IF(ISNUMBER(Būvkalumi!G93),Būvkalumi!B93,\"\")","v":""},{"$f":"IF(ISNUMBER(Būvkalumi!G93),Būvkalumi!C93,\"\")","v":""},{"$f":"IF(ISNUMBER(Būvkalumi!G93),Būvkalumi!E93,\"\")","v":""},{"$f":"IF(ISNUMBER(Būvkalumi!G93),Būvkalumi!G93,\"\")","v":""},{"$f":"IF(ISNUMBER(Būvkalumi!G93),Būvkalumi!H93,\"\")","v":""},{"$f":"IF(ISTEXT(Būvkalumi!I93),Būvkalumi!I93,\"\")","v":""},""]
[{"$f":"IF(ISNUMBER(Būvkalumi!G94),Būvkalumi!A94,\"\")","v":""},{"$f":"IF(ISNUMBER(Būvkalumi!G94),Būvkalumi!B94,\"\")","v":""},{"$f":"IF(ISNUMBER(Būvkalumi!G94),Būvkalumi!C94,\"\")","v":""},{"$f":"IF(ISNUMBER(Būvkalumi!G94),Būvkalumi!E94,\"\")","v":""},{"$f":"IF(ISNUMBER(Būvkalumi!G94),Būvkalumi!G94,\"\")","v":""},{"$f":"IF(ISNUMBER(Būvkalumi!G94),Būvkalumi!H94,\"\")","v":""},{"$f":"IF(ISTEXT(Būvkalumi!I94),Būvkalumi!I94,\"\")","v":""},""]
[{"$f":"IF(ISNUMBER(Būvkalumi!G95),Būvkalumi!A95,\"\")","v":""},{"$f":"IF(ISNUMBER(Būvkalumi!G95),Būvkalumi!B95,\"\")","v":""},{"$f":"IF(ISNUMBER(Būvkalumi!G95),Būvkalumi!C95,\"\")","v":""},{"$f":"IF(ISNUMBER(Būvkalumi!G95),Būvkalumi!E95,\"\")","v":""},{"$f":"IF(ISNUMBER(Būvkalumi!G95),Būvkalumi!G95,\"\")","v":""},{"$f":"IF(ISNUMBER(Būvkalumi!G95),Būvkalumi!H95,\"\")","v":""},{"$f":"IF(ISTEXT(Būvkalumi!I95),Būvkalumi!I95,\"\")","v":""},""]
[{"$f":"IF(ISNUMBER(Būvkalumi!G96),Būvkalumi!A96,\"\")","v":""},{"$f":"IF(ISNUMBER(Būvkalumi!G96),Būvkalumi!B96,\"\")","v":""},{"$f":"IF(ISNUMBER(Būvkalumi!G96),Būvkalumi!C96,\"\")","v":""},{"$f":"IF(ISNUMBER(Būvkalumi!G96),Būvkalumi!E96,\"\")","v":""},{"$f":"IF(ISNUMBER(Būvkalumi!G96),Būvkalumi!G96,\"\")","v":""},{"$f":"IF(ISNUMBER(Būvkalumi!G96),Būvkalumi!H96,\"\")","v":""},{"$f":"IF(ISTEXT(Būvkalumi!I96),Būvkalumi!I96,\"\")","v":""},""]
[{"$f":"IF(ISNUMBER(Būvkalumi!G97),Būvkalumi!A97,\"\")","v":""},{"$f":"IF(ISNUMBER(Būvkalumi!G97),Būvkalumi!B97,\"\")","v":""},{"$f":"IF(ISNUMBER(Būvkalumi!G97),Būvkalumi!C97,\"\")","v":""},{"$f":"IF(ISNUMBER(Būvkalumi!G97),Būvkalumi!E97,\"\")","v":""},{"$f":"IF(ISNUMBER(Būvkalumi!G97),Būvkalumi!G97,\"\")","v":""},{"$f":"IF(ISNUMBER(Būvkalumi!G97),Būvkalumi!H97,\"\")","v":""},{"$f":"IF(ISTEXT(Būvkalumi!I97),Būvkalumi!I97,\"\")","v":""},""]
[{"$f":"IF(ISNUMBER(Būvkalumi!G98),Būvkalumi!A98,\"\")","v":""},{"$f":"IF(ISNUMBER(Būvkalumi!G98),Būvkalumi!B98,\"\")","v":""},{"$f":"IF(ISNUMBER(Būvkalumi!G98),Būvkalumi!C98,\"\")","v":""},{"$f":"IF(ISNUMBER(Būvkalumi!G98),Būvkalumi!E98,\"\")","v":""},{"$f":"IF(ISNUMBER(Būvkalumi!G98),Būvkalumi!G98,\"\")","v":""},{"$f":"IF(ISNUMBER(Būvkalumi!G98),Būvkalumi!H98,\"\")","v":""},{"$f":"IF(ISTEXT(Būvkalumi!I98),Būvkalumi!I98,\"\")","v":""},""]
[{"$f":"IF(ISNUMBER(Būvkalumi!G99),Būvkalumi!A99,\"\")","v":""},{"$f":"IF(ISNUMBER(Būvkalumi!G99),Būvkalumi!B99,\"\")","v":""},{"$f":"IF(ISNUMBER(Būvkalumi!G99),Būvkalumi!C99,\"\")","v":""},{"$f":"IF(ISNUMBER(Būvkalumi!G99),Būvkalumi!E99,\"\")","v":""},{"$f":"IF(ISNUMBER(Būvkalumi!G99),Būvkalumi!G99,\"\")","v":""},{"$f":"IF(ISNUMBER(Būvkalumi!G99),Būvkalumi!H99,\"\")","v":""},{"$f":"IF(ISTEXT(Būvkalumi!I99),Būvkalumi!I99,\"\")","v":""},""]
[{"$f":"IF(ISNUMBER(Būvkalumi!G100),Būvkalumi!A100,\"\")","v":""},{"$f":"IF(ISNUMBER(Būvkalumi!G100),Būvkalumi!B100,\"\")","v":""},{"$f":"IF(ISNUMBER(Būvkalumi!G100),Būvkalumi!C100,\"\")","v":""},{"$f":"IF(ISNUMBER(Būvkalumi!G100),Būvkalumi!E100,\"\")","v":""},{"$f":"IF(ISNUMBER(Būvkalumi!G100),Būvkalumi!G100,\"\")","v":""},{"$f":"IF(ISNUMBER(Būvkalumi!G100),Būvkalumi!H100,\"\")","v":""},{"$f":"IF(ISTEXT(Būvkalumi!I100),Būvkalumi!I100,\"\")","v":""},""]
[{"$f":"IF(ISNUMBER(Būvkalumi!G101),Būvkalumi!A101,\"\")","v":""},{"$f":"IF(ISNUMBER(Būvkalumi!G101),Būvkalumi!B101,\"\")","v":""},{"$f":"IF(ISNUMBER(Būvkalumi!G101),Būvkalumi!C101,\"\")","v":""},{"$f":"IF(ISNUMBER(Būvkalumi!G101),Būvkalumi!E101,\"\")","v":""},{"$f":"IF(ISNUMBER(Būvkalumi!G101),Būvkalumi!G101,\"\")","v":""},{"$f":"IF(ISNUMBER(Būvkalumi!G101),Būvkalumi!H101,\"\")","v":""},{"$f":"IF(ISTEXT(Būvkalumi!I101),Būvkalumi!I101,\"\")","v":""},""]
[{"$f":"IF(ISNUMBER(Būvkalumi!G102),Būvkalumi!A102,\"\")","v":""},{"$f":"IF(ISNUMBER(Būvkalumi!G102),Būvkalumi!B102,\"\")","v":""},{"$f":"IF(ISNUMBER(Būvkalumi!G102),Būvkalumi!C102,\"\")","v":""},{"$f":"IF(ISNUMBER(Būvkalumi!G102),Būvkalumi!E102,\"\")","v":""},{"$f":"IF(ISNUMBER(Būvkalumi!G102),Būvkalumi!G102,\"\")","v":""},{"$f":"IF(ISNUMBER(Būvkalumi!G102),Būvkalumi!H102,\"\")","v":""},{"$f":"IF(ISTEXT(Būvkalumi!I102),Būvkalumi!I102,\"\")","v":""},""]
[{"$f":"IF(ISNUMBER(Būvkalumi!G103),Būvkalumi!A103,\"\")","v":""},{"$f":"IF(ISNUMBER(Būvkalumi!G103),Būvkalumi!B103,\"\")","v":""},{"$f":"IF(ISNUMBER(Būvkalumi!G103),Būvkalumi!C103,\"\")","v":""},{"$f":"IF(ISNUMBER(Būvkalumi!G103),Būvkalumi!E103,\"\")","v":""},{"$f":"IF(ISNUMBER(Būvkalumi!G103),Būvkalumi!G103,\"\")","v":""},{"$f":"IF(ISNUMBER(Būvkalumi!G103),Būvkalumi!H103,\"\")","v":""},{"$f":"IF(ISTEXT(Būvkalumi!I103),Būvkalumi!I103,\"\")","v":""},""]
[{"$f":"IF(ISNUMBER(Būvkalumi!G104),Būvkalumi!A104,\"\")","v":""},{"$f":"IF(ISNUMBER(Būvkalumi!G104),Būvkalumi!B104,\"\")","v":""},{"$f":"IF(ISNUMBER(Būvkalumi!G104),Būvkalumi!C104,\"\")","v":""},{"$f":"IF(ISNUMBER(Būvkalumi!G104),Būvkalumi!E104,\"\")","v":""},{"$f":"IF(ISNUMBER(Būvkalumi!G104),Būvkalumi!G104,\"\")","v":""},{"$f":"IF(ISNUMBER(Būvkalumi!G104),Būvkalumi!H104,\"\")","v":""},{"$f":"IF(ISTEXT(Būvkalumi!I104),Būvkalumi!I104,\"\")","v":""},""]
[{"$f":"IF(ISNUMBER(Būvkalumi!G105),Būvkalumi!A105,\"\")","v":""},{"$f":"IF(ISNUMBER(Būvkalumi!G105),Būvkalumi!B105,\"\")","v":""},{"$f":"IF(ISNUMBER(Būvkalumi!G105),Būvkalumi!C105,\"\")","v":""},{"$f":"IF(ISNUMBER(Būvkalumi!G105),Būvkalumi!E105,\"\")","v":""},{"$f":"IF(ISNUMBER(Būvkalumi!G105),Būvkalumi!G105,\"\")","v":""},{"$f":"IF(ISNUMBER(Būvkalumi!G105),Būvkalumi!H105,\"\")","v":""},{"$f":"IF(ISTEXT(Būvkalumi!I105),Būvkalumi!I105,\"\")","v":""},""]
[{"$f":"IF(ISNUMBER(Būvkalumi!G106),Būvkalumi!A106,\"\")","v":""},{"$f":"IF(ISNUMBER(Būvkalumi!G106),Būvkalumi!B106,\"\")","v":""},{"$f":"IF(ISNUMBER(Būvkalumi!G106),Būvkalumi!C106,\"\")","v":""},{"$f":"IF(ISNUMBER(Būvkalumi!G106),Būvkalumi!E106,\"\")","v":""},{"$f":"IF(ISNUMBER(Būvkalumi!G106),Būvkalumi!G106,\"\")","v":""},{"$f":"IF(ISNUMBER(Būvkalumi!G106),Būvkalumi!H106,\"\")","v":""},{"$f":"IF(ISTEXT(Būvkalumi!I106),Būvkalumi!I106,\"\")","v":""},""]
[{"$f":"IF(ISNUMBER(Būvkalumi!G107),Būvkalumi!A107,\"\")","v":""},{"$f":"IF(ISNUMBER(Būvkalumi!G107),Būvkalumi!B107,\"\")","v":""},{"$f":"IF(ISNUMBER(Būvkalumi!G107),Būvkalumi!C107,\"\")","v":""},{"$f":"IF(ISNUMBER(Būvkalumi!G107),Būvkalumi!E107,\"\")","v":""},{"$f":"IF(ISNUMBER(Būvkalumi!G107),Būvkalumi!G107,\"\")","v":""},{"$f":"IF(ISNUMBER(Būvkalumi!G107),Būvkalumi!H107,\"\")","v":""},{"$f":"IF(ISTEXT(Būvkalumi!I107),Būvkalumi!I107,\"\")","v":""},""]
[{"$f":"IF(ISNUMBER(Būvkalumi!G108),Būvkalumi!A108,\"\")","v":""},{"$f":"IF(ISNUMBER(Būvkalumi!G108),Būvkalumi!B108,\"\")","v":""},{"$f":"IF(ISNUMBER(Būvkalumi!G108),Būvkalumi!C108,\"\")","v":""},{"$f":"IF(ISNUMBER(Būvkalumi!G108),Būvkalumi!E108,\"\")","v":""},{"$f":"IF(ISNUMBER(Būvkalumi!G108),Būvkalumi!G108,\"\")","v":""},{"$f":"IF(ISNUMBER(Būvkalumi!G108),Būvkalumi!H108,\"\")","v":""},{"$f":"IF(ISTEXT(Būvkalumi!I108),Būvkalumi!I108,\"\")","v":""},""]
[{"$f":"IF(ISNUMBER(Būvkalumi!G109),Būvkalumi!A109,\"\")","v":""},{"$f":"IF(ISNUMBER(Būvkalumi!G109),Būvkalumi!B109,\"\")","v":""},{"$f":"IF(ISNUMBER(Būvkalumi!G109),Būvkalumi!C109,\"\")","v":""},{"$f":"IF(ISNUMBER(Būvkalumi!G109),Būvkalumi!E109,\"\")","v":""},{"$f":"IF(ISNUMBER(Būvkalumi!G109),Būvkalumi!G109,\"\")","v":""},{"$f":"IF(ISNUMBER(Būvkalumi!G109),Būvkalumi!H109,\"\")","v":""},{"$f":"IF(ISTEXT(Būvkalumi!I109),Būvkalumi!I109,\"\")","v":""},""]
[{"$f":"IF(ISNUMBER(Būvkalumi!G110),Būvkalumi!A110,\"\")","v":""},{"$f":"IF(ISNUMBER(Būvkalumi!G110),Būvkalumi!B110,\"\")","v":""},{"$f":"IF(ISNUMBER(Būvkalumi!G110),Būvkalumi!C110,\"\")","v":""},{"$f":"IF(ISNUMBER(Būvkalumi!G110),Būvkalumi!E110,\"\")","v":""},{"$f":"IF(ISNUMBER(Būvkalumi!G110),Būvkalumi!G110,\"\")","v":""},{"$f":"IF(ISNUMBER(Būvkalumi!G110),Būvkalumi!H110,\"\")","v":""},{"$f":"IF(ISTEXT(Būvkalumi!I110),Būvkalumi!I110,\"\")","v":""},""]
[{"$f":"IF(ISNUMBER(Būvkalumi!G111),Būvkalumi!A111,\"\")","v":""},{"$f":"IF(ISNUMBER(Būvkalumi!G111),Būvkalumi!B111,\"\")","v":""},{"$f":"IF(ISNUMBER(Būvkalumi!G111),Būvkalumi!C111,\"\")","v":""},{"$f":"IF(ISNUMBER(Būvkalumi!G111),Būvkalumi!E111,\"\")","v":""},{"$f":"IF(ISNUMBER(Būvkalumi!G111),Būvkalumi!G111,\"\")","v":""},{"$f":"IF(ISNUMBER(Būvkalumi!G111),Būvkalumi!H111,\"\")","v":""},{"$f":"IF(ISTEXT(Būvkalumi!I111),Būvkalumi!I111,\"\")","v":""},""]
[{"$f":"IF(ISNUMBER(Būvkalumi!G112),Būvkalumi!A112,\"\")","v":""},{"$f":"IF(ISNUMBER(Būvkalumi!G112),Būvkalumi!B112,\"\")","v":""},{"$f":"IF(ISNUMBER(Būvkalumi!G112),Būvkalumi!C112,\"\")","v":""},{"$f":"IF(ISNUMBER(Būvkalumi!G112),Būvkalumi!E112,\"\")","v":""},{"$f":"IF(ISNUMBER(Būvkalumi!G112),Būvkalumi!G112,\"\")","v":""},{"$f":"IF(ISNUMBER(Būvkalumi!G112),Būvkalumi!H112,\"\")","v":""},{"$f":"IF(ISTEXT(Būvkalumi!I112),Būvkalumi!I112,\"\")","v":""},""]
[{"$f":"IF(ISNUMBER(Būvkalumi!G113),Būvkalumi!A113,\"\")","v":""},{"$f":"IF(ISNUMBER(Būvkalumi!G113),Būvkalumi!B113,\"\")","v":""},{"$f":"IF(ISNUMBER(Būvkalumi!G113),Būvkalumi!C113,\"\")","v":""},{"$f":"IF(ISNUMBER(Būvkalumi!G113),Būvkalumi!E113,\"\")","v":""},{"$f":"IF(ISNUMBER(Būvkalumi!G113),Būvkalumi!G113,\"\")","v":""},{"$f":"IF(ISNUMBER(Būvkalumi!G113),Būvkalumi!H113,\"\")","v":""},{"$f":"IF(ISTEXT(Būvkalumi!I113),Būvkalumi!I113,\"\")","v":""},""]
[{"$f":"IF(ISNUMBER(Būvkalumi!G114),Būvkalumi!A114,\"\")","v":""},{"$f":"IF(ISNUMBER(Būvkalumi!G114),Būvkalumi!B114,\"\")","v":""},{"$f":"IF(ISNUMBER(Būvkalumi!G114),Būvkalumi!C114,\"\")","v":""},{"$f":"IF(ISNUMBER(Būvkalumi!G114),Būvkalumi!E114,\"\")","v":""},{"$f":"IF(ISNUMBER(Būvkalumi!G114),Būvkalumi!G114,\"\")","v":""},{"$f":"IF(ISNUMBER(Būvkalumi!G114),Būvkalumi!H114,\"\")","v":""},{"$f":"IF(ISTEXT(Būvkalumi!I114),Būvkalumi!I114,\"\")","v":""},""]
[{"$f":"IF(ISNUMBER(Būvkalumi!G115),Būvkalumi!A115,\"\")","v":""},{"$f":"IF(ISNUMBER(Būvkalumi!G115),Būvkalumi!B115,\"\")","v":""},{"$f":"IF(ISNUMBER(Būvkalumi!G115),Būvkalumi!C115,\"\")","v":""},{"$f":"IF(ISNUMBER(Būvkalumi!G115),Būvkalumi!E115,\"\")","v":""},{"$f":"IF(ISNUMBER(Būvkalumi!G115),Būvkalumi!G115,\"\")","v":""},{"$f":"IF(ISNUMBER(Būvkalumi!G115),Būvkalumi!H115,\"\")","v":""},{"$f":"IF(ISTEXT(Būvkalumi!I115),Būvkalumi!I115,\"\")","v":""},""]
[{"$f":"IF(ISNUMBER(Būvkalumi!G116),Būvkalumi!A116,\"\")","v":""},{"$f":"IF(ISNUMBER(Būvkalumi!G116),Būvkalumi!B116,\"\")","v":""},{"$f":"IF(ISNUMBER(Būvkalumi!G116),Būvkalumi!C116,\"\")","v":""},{"$f":"IF(ISNUMBER(Būvkalumi!G116),Būvkalumi!E116,\"\")","v":""},{"$f":"IF(ISNUMBER(Būvkalumi!G116),Būvkalumi!G116,\"\")","v":""},{"$f":"IF(ISNUMBER(Būvkalumi!G116),Būvkalumi!H116,\"\")","v":""},{"$f":"IF(ISTEXT(Būvkalumi!I116),Būvkalumi!I116,\"\")","v":""},""]
[{"$f":"IF(ISNUMBER(Būvkalumi!G117),Būvkalumi!A117,\"\")","v":""},{"$f":"IF(ISNUMBER(Būvkalumi!G117),Būvkalumi!B117,\"\")","v":""},{"$f":"IF(ISNUMBER(Būvkalumi!G117),Būvkalumi!C117,\"\")","v":""},{"$f":"IF(ISNUMBER(Būvkalumi!G117),Būvkalumi!E117,\"\")","v":""},{"$f":"IF(ISNUMBER(Būvkalumi!G117),Būvkalumi!G117,\"\")","v":""},{"$f":"IF(ISNUMBER(Būvkalumi!G117),Būvkalumi!H117,\"\")","v":""},{"$f":"IF(ISTEXT(Būvkalumi!I117),Būvkalumi!I117,\"\")","v":""},""]
[{"$f":"IF(ISNUMBER(Būvkalumi!G118),Būvkalumi!A118,\"\")","v":""},{"$f":"IF(ISNUMBER(Būvkalumi!G118),Būvkalumi!B118,\"\")","v":""},{"$f":"IF(ISNUMBER(Būvkalumi!G118),Būvkalumi!C118,\"\")","v":""},{"$f":"IF(ISNUMBER(Būvkalumi!G118),Būvkalumi!E118,\"\")","v":""},{"$f":"IF(ISNUMBER(Būvkalumi!G118),Būvkalumi!G118,\"\")","v":""},{"$f":"IF(ISNUMBER(Būvkalumi!G118),Būvkalumi!H118,\"\")","v":""},{"$f":"IF(ISTEXT(Būvkalumi!I118),Būvkalumi!I118,\"\")","v":""},""]
[{"$f":"IF(ISNUMBER(Būvkalumi!G119),Būvkalumi!A119,\"\")","v":""},{"$f":"IF(ISNUMBER(Būvkalumi!G119),Būvkalumi!B119,\"\")","v":""},{"$f":"IF(ISNUMBER(Būvkalumi!G119),Būvkalumi!C119,\"\")","v":""},{"$f":"IF(ISNUMBER(Būvkalumi!G119),Būvkalumi!E119,\"\")","v":""},{"$f":"IF(ISNUMBER(Būvkalumi!G119),Būvkalumi!G119,\"\")","v":""},{"$f":"IF(ISNUMBER(Būvkalumi!G119),Būvkalumi!H119,\"\")","v":""},{"$f":"IF(ISTEXT(Būvkalumi!I119),Būvkalumi!I119,\"\")","v":""},""]
[{"$f":"IF(ISNUMBER(Būvkalumi!G120),Būvkalumi!A120,\"\")","v":""},{"$f":"IF(ISNUMBER(Būvkalumi!G120),Būvkalumi!B120,\"\")","v":""},{"$f":"IF(ISNUMBER(Būvkalumi!G120),Būvkalumi!C120,\"\")","v":""},{"$f":"IF(ISNUMBER(Būvkalumi!G120),Būvkalumi!E120,\"\")","v":""},{"$f":"IF(ISNUMBER(Būvkalumi!G120),Būvkalumi!G120,\"\")","v":""},{"$f":"IF(ISNUMBER(Būvkalumi!G120),Būvkalumi!H120,\"\")","v":""},{"$f":"IF(ISTEXT(Būvkalumi!I120),Būvkalumi!I120,\"\")","v":""},""]
[{"$f":"IF(ISNUMBER(Būvkalumi!G121),Būvkalumi!A121,\"\")","v":""},{"$f":"IF(ISNUMBER(Būvkalumi!G121),Būvkalumi!B121,\"\")","v":""},{"$f":"IF(ISNUMBER(Būvkalumi!G121),Būvkalumi!C121,\"\")","v":""},{"$f":"IF(ISNUMBER(Būvkalumi!G121),Būvkalumi!E121,\"\")","v":""},{"$f":"IF(ISNUMBER(Būvkalumi!G121),Būvkalumi!G121,\"\")","v":""},{"$f":"IF(ISNUMBER(Būvkalumi!G121),Būvkalumi!H121,\"\")","v":""},{"$f":"IF(ISTEXT(Būvkalumi!I121),Būvkalumi!I121,\"\")","v":""},""]
[{"$f":"IF(ISNUMBER(Būvkalumi!G122),Būvkalumi!A122,\"\")","v":""},{"$f":"IF(ISNUMBER(Būvkalumi!G122),Būvkalumi!B122,\"\")","v":""},{"$f":"IF(ISNUMBER(Būvkalumi!G122),Būvkalumi!C122,\"\")","v":""},{"$f":"IF(ISNUMBER(Būvkalumi!G122),Būvkalumi!E122,\"\")","v":""},{"$f":"IF(ISNUMBER(Būvkalumi!G122),Būvkalumi!G122,\"\")","v":""},{"$f":"IF(ISNUMBER(Būvkalumi!G122),Būvkalumi!H122,\"\")","v":""},{"$f":"IF(ISTEXT(Būvkalumi!I122),Būvkalumi!I122,\"\")","v":""},""]
[{"$f":"IF(ISNUMBER(Būvkalumi!G123),Būvkalumi!A123,\"\")","v":""},{"$f":"IF(ISNUMBER(Būvkalumi!G123),Būvkalumi!B123,\"\")","v":""},{"$f":"IF(ISNUMBER(Būvkalumi!G123),Būvkalumi!C123,\"\")","v":""},{"$f":"IF(ISNUMBER(Būvkalumi!G123),Būvkalumi!E123,\"\")","v":""},{"$f":"IF(ISNUMBER(Būvkalumi!G123),Būvkalumi!G123,\"\")","v":""},{"$f":"IF(ISNUMBER(Būvkalumi!G123),Būvkalumi!H123,\"\")","v":""},{"$f":"IF(ISTEXT(Būvkalumi!I123),Būvkalumi!I123,\"\")","v":""},""]
[{"$f":"IF(ISNUMBER(Terauda!G4),Terauda!A4,\"\")","v":""},{"$f":"IF(ISNUMBER(Terauda!G4),Terauda!B4,\"\")","v":""},{"$f":"IF(ISNUMBER(Terauda!G4),Terauda!C4,\"\")","v":""},{"$f":"IF(ISNUMBER(Terauda!G4),Terauda!E4,\"\")","v":""},{"$f":"IF(ISNUMBER(Terauda!G4),Terauda!G4,\"\")","v":""},{"$f":"IF(ISNUMBER(Terauda!G4),Terauda!H4,\"\")","v":""},{"$f":"IF(ISTEXT(Terauda!I4),Terauda!I4,\"\")","v":""},{"$f":"IF(ISNUMBER(E722),\"yes\",\"\")","v":""}]
[{"$f":"IF(ISNUMBER(Terauda!G5),Terauda!A5,\"\")","v":""},{"$f":"IF(ISNUMBER(Terauda!G5),Terauda!B5,\"\")","v":""},{"$f":"IF(ISNUMBER(Terauda!G5),Terauda!C5,\"\")","v":""},{"$f":"IF(ISNUMBER(Terauda!G5),Terauda!E5,\"\")","v":""},{"$f":"IF(ISNUMBER(Terauda!G5),Terauda!G5,\"\")","v":""},{"$f":"IF(ISNUMBER(Terauda!G5),Terauda!H5,\"\")","v":""},{"$f":"IF(ISTEXT(Terauda!I5),Terauda!I5,\"\")","v":""},{"$f":"IF(ISNUMBER(E723),\"yes\",\"\")","v":""}]
[{"$f":"IF(ISNUMBER(Terauda!G6),Terauda!A6,\"\")","v":""},{"$f":"IF(ISNUMBER(Terauda!G6),Terauda!B6,\"\")","v":""},{"$f":"IF(ISNUMBER(Terauda!G6),Terauda!C6,\"\")","v":""},{"$f":"IF(ISNUMBER(Terauda!G6),Terauda!E6,\"\")","v":""},{"$f":"IF(ISNUMBER(Terauda!G6),Terauda!G6,\"\")","v":""},{"$f":"IF(ISNUMBER(Terauda!G6),Terauda!H6,\"\")","v":""},{"$f":"IF(ISTEXT(Terauda!I6),Terauda!I6,\"\")","v":""},""]
[{"$f":"IF(ISNUMBER(Terauda!G7),Terauda!A7,\"\")","v":""},{"$f":"IF(ISNUMBER(Terauda!G7),Terauda!B7,\"\")","v":""},{"$f":"IF(ISNUMBER(Terauda!G7),Terauda!C7,\"\")","v":""},{"$f":"IF(ISNUMBER(Terauda!G7),Terauda!E7,\"\")","v":""},{"$f":"IF(ISNUMBER(Terauda!G7),Terauda!G7,\"\")","v":""},{"$f":"IF(ISNUMBER(Terauda!G7),Terauda!H7,\"\")","v":""},{"$f":"IF(ISTEXT(Terauda!I7),Terauda!I7,\"\")","v":""},""]
[{"$f":"IF(ISNUMBER(Terauda!G8),Terauda!A8,\"\")","v":""},{"$f":"IF(ISNUMBER(Terauda!G8),Terauda!B8,\"\")","v":""},{"$f":"IF(ISNUMBER(Terauda!G8),Terauda!C8,\"\")","v":""},{"$f":"IF(ISNUMBER(Terauda!G8),Terauda!E8,\"\")","v":""},{"$f":"IF(ISNUMBER(Terauda!G8),Terauda!G8,\"\")","v":""},{"$f":"IF(ISNUMBER(Terauda!G8),Terauda!H8,\"\")","v":""},{"$f":"IF(ISTEXT(Terauda!I8),Terauda!I8,\"\")","v":""},""]
[{"$f":"IF(ISNUMBER(Terauda!G9),Terauda!A9,\"\")","v":""},{"$f":"IF(ISNUMBER(Terauda!G9),Terauda!B9,\"\")","v":""},{"$f":"IF(ISNUMBER(Terauda!G9),Terauda!C9,\"\")","v":""},{"$f":"IF(ISNUMBER(Terauda!G9),Terauda!E9,\"\")","v":""},{"$f":"IF(ISNUMBER(Terauda!G9),Terauda!G9,\"\")","v":""},{"$f":"IF(ISNUMBER(Terauda!G9),Terauda!H9,\"\")","v":""},{"$f":"IF(ISTEXT(Terauda!I9),Terauda!I9,\"\")","v":""},""]
[{"$f":"IF(ISNUMBER(Terauda!G10),Terauda!A10,\"\")","v":""},{"$f":"IF(ISNUMBER(Terauda!G10),Terauda!B10,\"\")","v":""},{"$f":"IF(ISNUMBER(Terauda!G10),Terauda!C10,\"\")","v":""},{"$f":"IF(ISNUMBER(Terauda!G10),Terauda!E10,\"\")","v":""},{"$f":"IF(ISNUMBER(Terauda!G10),Terauda!G10,\"\")","v":""},{"$f":"IF(ISNUMBER(Terauda!G10),Terauda!H10,\"\")","v":""},{"$f":"IF(ISTEXT(Terauda!I10),Terauda!I10,\"\")","v":""},""]
[{"$f":"IF(ISNUMBER(Terauda!G11),Terauda!A11,\"\")","v":""},{"$f":"IF(ISNUMBER(Terauda!G11),Terauda!B11,\"\")","v":""},{"$f":"IF(ISNUMBER(Terauda!G11),Terauda!C11,\"\")","v":""},{"$f":"IF(ISNUMBER(Terauda!G11),Terauda!E11,\"\")","v":""},{"$f":"IF(ISNUMBER(Terauda!G11),Terauda!G11,\"\")","v":""},{"$f":"IF(ISNUMBER(Terauda!G11),Terauda!H11,\"\")","v":""},{"$f":"IF(ISTEXT(Terauda!I11),Terauda!I11,\"\")","v":""},""]
[{"$f":"IF(ISNUMBER(Terauda!G12),Terauda!A12,\"\")","v":""},{"$f":"IF(ISNUMBER(Terauda!G12),Terauda!B12,\"\")","v":""},{"$f":"IF(ISNUMBER(Terauda!G12),Terauda!C12,\"\")","v":""},{"$f":"IF(ISNUMBER(Terauda!G12),Terauda!E12,\"\")","v":""},{"$f":"IF(ISNUMBER(Terauda!G12),Terauda!G12,\"\")","v":""},{"$f":"IF(ISNUMBER(Terauda!G12),Terauda!H12,\"\")","v":""},{"$f":"IF(ISTEXT(Terauda!I12),Terauda!I12,\"\")","v":""},""]
[{"$f":"IF(ISNUMBER(Terauda!G13),Terauda!A13,\"\")","v":""},{"$f":"IF(ISNUMBER(Terauda!G13),Terauda!B13,\"\")","v":""},{"$f":"IF(ISNUMBER(Terauda!G13),Terauda!C13,\"\")","v":""},{"$f":"IF(ISNUMBER(Terauda!G13),Terauda!E13,\"\")","v":""},{"$f":"IF(ISNUMBER(Terauda!G13),Terauda!G13,\"\")","v":""},{"$f":"IF(ISNUMBER(Terauda!G13),Terauda!H13,\"\")","v":""},{"$f":"IF(ISTEXT(Terauda!I13),Terauda!I13,\"\")","v":""},""]
[{"$f":"IF(ISNUMBER(Terauda!G14),Terauda!A14,\"\")","v":""},{"$f":"IF(ISNUMBER(Terauda!G14),Terauda!B14,\"\")","v":""},{"$f":"IF(ISNUMBER(Terauda!G14),Terauda!C14,\"\")","v":""},{"$f":"IF(ISNUMBER(Terauda!G14),Terauda!E14,\"\")","v":""},{"$f":"IF(ISNUMBER(Terauda!G14),Terauda!G14,\"\")","v":""},{"$f":"IF(ISNUMBER(Terauda!G14),Terauda!H14,\"\")","v":""},{"$f":"IF(ISTEXT(Terauda!I14),Terauda!I14,\"\")","v":""},""]
[{"$f":"IF(ISNUMBER(Terauda!G15),Terauda!A15,\"\")","v":""},{"$f":"IF(ISNUMBER(Terauda!G15),Terauda!B15,\"\")","v":""},{"$f":"IF(ISNUMBER(Terauda!G15),Terauda!C15,\"\")","v":""},{"$f":"IF(ISNUMBER(Terauda!G15),Terauda!E15,\"\")","v":""},{"$f":"IF(ISNUMBER(Terauda!G15),Terauda!G15,\"\")","v":""},{"$f":"IF(ISNUMBER(Terauda!G15),Terauda!H15,\"\")","v":""},{"$f":"IF(ISTEXT(Terauda!I15),Terauda!I15,\"\")","v":""},""]
[{"$f":"IF(ISNUMBER(Terauda!G16),Terauda!A16,\"\")","v":""},{"$f":"IF(ISNUMBER(Terauda!G16),Terauda!B16,\"\")","v":""},{"$f":"IF(ISNUMBER(Terauda!G16),Terauda!C16,\"\")","v":""},{"$f":"IF(ISNUMBER(Terauda!G16),Terauda!E16,\"\")","v":""},{"$f":"IF(ISNUMBER(Terauda!G16),Terauda!G16,\"\")","v":""},{"$f":"IF(ISNUMBER(Terauda!G16),Terauda!H16,\"\")","v":""},{"$f":"IF(ISTEXT(Terauda!I16),Terauda!I16,\"\")","v":""},""]
[{"$f":"IF(ISNUMBER(Terauda!G17),Terauda!A17,\"\")","v":""},{"$f":"IF(ISNUMBER(Terauda!G17),Terauda!B17,\"\")","v":""},{"$f":"IF(ISNUMBER(Terauda!G17),Terauda!C17,\"\")","v":""},{"$f":"IF(ISNUMBER(Terauda!G17),Terauda!E17,\"\")","v":""},{"$f":"IF(ISNUMBER(Terauda!G17),Terauda!G17,\"\")","v":""},{"$f":"IF(ISNUMBER(Terauda!G17),Terauda!H17,\"\")","v":""},{"$f":"IF(ISTEXT(Terauda!I17),Terauda!I17,\"\")","v":""},""]
[{"$f":"IF(ISNUMBER(Terauda!G18),Terauda!A18,\"\")","v":""},{"$f":"IF(ISNUMBER(Terauda!G18),Terauda!B18,\"\")","v":""},{"$f":"IF(ISNUMBER(Terauda!G18),Terauda!C18,\"\")","v":""},{"$f":"IF(ISNUMBER(Terauda!G18),Terauda!E18,\"\")","v":""},{"$f":"IF(ISNUMBER(Terauda!G18),Terauda!G18,\"\")","v":""},{"$f":"IF(ISNUMBER(Terauda!G18),Terauda!H18,\"\")","v":""},{"$f":"IF(ISTEXT(Terauda!I18),Terauda!I18,\"\")","v":""},""]
[{"$f":"IF(ISNUMBER(Terauda!G19),Terauda!A19,\"\")","v":""},{"$f":"IF(ISNUMBER(Terauda!G19),Terauda!B19,\"\")","v":""},{"$f":"IF(ISNUMBER(Terauda!G19),Terauda!C19,\"\")","v":""},{"$f":"IF(ISNUMBER(Terauda!G19),Terauda!E19,\"\")","v":""},{"$f":"IF(ISNUMBER(Terauda!G19),Terauda!G19,\"\")","v":""},{"$f":"IF(ISNUMBER(Terauda!G19),Terauda!H19,\"\")","v":""},{"$f":"IF(ISTEXT(Terauda!I19),Terauda!I19,\"\")","v":""},""]
[{"$f":"IF(ISNUMBER(Terauda!G20),Terauda!A20,\"\")","v":""},{"$f":"IF(ISNUMBER(Terauda!G20),Terauda!B20,\"\")","v":""},{"$f":"IF(ISNUMBER(Terauda!G20),Terauda!C20,\"\")","v":""},{"$f":"IF(ISNUMBER(Terauda!G20),Terauda!E20,\"\")","v":""},{"$f":"IF(ISNUMBER(Terauda!G20),Terauda!G20,\"\")","v":""},{"$f":"IF(ISNUMBER(Terauda!G20),Terauda!H20,\"\")","v":""},{"$f":"IF(ISTEXT(Terauda!I20),Terauda!I20,\"\")","v":""},""]
[{"$f":"IF(ISNUMBER(Terauda!G21),Terauda!A21,\"\")","v":""},{"$f":"IF(ISNUMBER(Terauda!G21),Terauda!B21,\"\")","v":""},{"$f":"IF(ISNUMBER(Terauda!G21),Terauda!C21,\"\")","v":""},{"$f":"IF(ISNUMBER(Terauda!G21),Terauda!E21,\"\")","v":""},{"$f":"IF(ISNUMBER(Terauda!G21),Terauda!G21,\"\")","v":""},{"$f":"IF(ISNUMBER(Terauda!G21),Terauda!H21,\"\")","v":""},{"$f":"IF(ISTEXT(Terauda!I21),Terauda!I21,\"\")","v":""},""]
[{"$f":"IF(ISNUMBER(Terauda!G22),Terauda!A22,\"\")","v":""},{"$f":"IF(ISNUMBER(Terauda!G22),Terauda!B22,\"\")","v":""},{"$f":"IF(ISNUMBER(Terauda!G22),Terauda!C22,\"\")","v":""},{"$f":"IF(ISNUMBER(Terauda!G22),Terauda!E22,\"\")","v":""},{"$f":"IF(ISNUMBER(Terauda!G22),Terauda!G22,\"\")","v":""},{"$f":"IF(ISNUMBER(Terauda!G22),Terauda!H22,\"\")","v":""},{"$f":"IF(ISTEXT(Terauda!I22),Terauda!I22,\"\")","v":""},""]
[{"$f":"IF(ISNUMBER(Terauda!G23),Terauda!A23,\"\")","v":""},{"$f":"IF(ISNUMBER(Terauda!G23),Terauda!B23,\"\")","v":""},{"$f":"IF(ISNUMBER(Terauda!G23),Terauda!C23,\"\")","v":""},{"$f":"IF(ISNUMBER(Terauda!G23),Terauda!E23,\"\")","v":""},{"$f":"IF(ISNUMBER(Terauda!G23),Terauda!G23,\"\")","v":""},{"$f":"IF(ISNUMBER(Terauda!G23),Terauda!H23,\"\")","v":""},{"$f":"IF(ISTEXT(Terauda!I23),Terauda!I23,\"\")","v":""},""]
[{"$f":"IF(ISNUMBER(Terauda!G24),Terauda!A24,\"\")","v":""},{"$f":"IF(ISNUMBER(Terauda!G24),Terauda!B24,\"\")","v":""},{"$f":"IF(ISNUMBER(Terauda!G24),Terauda!C24,\"\")","v":""},{"$f":"IF(ISNUMBER(Terauda!G24),Terauda!E24,\"\")","v":""},{"$f":"IF(ISNUMBER(Terauda!G24),Terauda!G24,\"\")","v":""},{"$f":"IF(ISNUMBER(Terauda!G24),Terauda!H24,\"\")","v":""},{"$f":"IF(ISTEXT(Terauda!I24),Terauda!I24,\"\")","v":""},""]
[{"$f":"IF(ISNUMBER(Terauda!G25),Terauda!A25,\"\")","v":""},{"$f":"IF(ISNUMBER(Terauda!G25),Terauda!B25,\"\")","v":""},{"$f":"IF(ISNUMBER(Terauda!G25),Terauda!C25,\"\")","v":""},{"$f":"IF(ISNUMBER(Terauda!G25),Terauda!E25,\"\")","v":""},{"$f":"IF(ISNUMBER(Terauda!G25),Terauda!G25,\"\")","v":""},{"$f":"IF(ISNUMBER(Terauda!G25),Terauda!H25,\"\")","v":""},{"$f":"IF(ISTEXT(Terauda!I25),Terauda!I25,\"\")","v":""},""]
[{"$f":"IF(ISNUMBER(Terauda!G26),Terauda!A26,\"\")","v":""},{"$f":"IF(ISNUMBER(Terauda!G26),Terauda!B26,\"\")","v":""},{"$f":"IF(ISNUMBER(Terauda!G26),Terauda!C26,\"\")","v":""},{"$f":"IF(ISNUMBER(Terauda!G26),Terauda!E26,\"\")","v":""},{"$f":"IF(ISNUMBER(Terauda!G26),Terauda!G26,\"\")","v":""},{"$f":"IF(ISNUMBER(Terauda!G26),Terauda!H26,\"\")","v":""},{"$f":"IF(ISTEXT(Terauda!I26),Terauda!I26,\"\")","v":""},""]
[{"$f":"IF(ISNUMBER(Terauda!G27),Terauda!A27,\"\")","v":""},{"$f":"IF(ISNUMBER(Terauda!G27),Terauda!B27,\"\")","v":""},{"$f":"IF(ISNUMBER(Terauda!G27),Terauda!C27,\"\")","v":""},{"$f":"IF(ISNUMBER(Terauda!G27),Terauda!E27,\"\")","v":""},{"$f":"IF(ISNUMBER(Terauda!G27),Terauda!G27,\"\")","v":""},{"$f":"IF(ISNUMBER(Terauda!G27),Terauda!H27,\"\")","v":""},{"$f":"IF(ISTEXT(Terauda!I27),Terauda!I27,\"\")","v":""},""]
[{"$f":"IF(ISNUMBER(Terauda!G28),Terauda!A28,\"\")","v":""},{"$f":"IF(ISNUMBER(Terauda!G28),Terauda!B28,\"\")","v":""},{"$f":"IF(ISNUMBER(Terauda!G28),Terauda!C28,\"\")","v":""},{"$f":"IF(ISNUMBER(Terauda!G28),Terauda!E28,\"\")","v":""},{"$f":"IF(ISNUMBER(Terauda!G28),Terauda!G28,\"\")","v":""},{"$f":"IF(ISNUMBER(Terauda!G28),Terauda!H28,\"\")","v":""},{"$f":"IF(ISTEXT(Terauda!I28),Terauda!I28,\"\")","v":""},""]
[{"$f":"IF(ISNUMBER(Terauda!G29),Terauda!A29,\"\")","v":""},{"$f":"IF(ISNUMBER(Terauda!G29),Terauda!B29,\"\")","v":""},{"$f":"IF(ISNUMBER(Terauda!G29),Terauda!C29,\"\")","v":""},{"$f":"IF(ISNUMBER(Terauda!G29),Terauda!E29,\"\")","v":""},{"$f":"IF(ISNUMBER(Terauda!G29),Terauda!G29,\"\")","v":""},{"$f":"IF(ISNUMBER(Terauda!G29),Terauda!H29,\"\")","v":""},{"$f":"IF(ISTEXT(Terauda!I29),Terauda!I29,\"\")","v":""},""]
[{"$f":"IF(ISNUMBER(Terauda!G30),Terauda!A30,\"\")","v":""},{"$f":"IF(ISNUMBER(Terauda!G30),Terauda!B30,\"\")","v":""},{"$f":"IF(ISNUMBER(Terauda!G30),Terauda!C30,\"\")","v":""},{"$f":"IF(ISNUMBER(Terauda!G30),Terauda!E30,\"\")","v":""},{"$f":"IF(ISNUMBER(Terauda!G30),Terauda!G30,\"\")","v":""},{"$f":"IF(ISNUMBER(Terauda!G30),Terauda!H30,\"\")","v":""},{"$f":"IF(ISTEXT(Terauda!I30),Terauda!I30,\"\")","v":""},""]
[{"$f":"IF(ISNUMBER(Terauda!G31),Terauda!A31,\"\")","v":""},{"$f":"IF(ISNUMBER(Terauda!G31),Terauda!B31,\"\")","v":""},{"$f":"IF(ISNUMBER(Terauda!G31),Terauda!C31,\"\")","v":""},{"$f":"IF(ISNUMBER(Terauda!G31),Terauda!E31,\"\")","v":""},{"$f":"IF(ISNUMBER(Terauda!G31),Terauda!G31,\"\")","v":""},{"$f":"IF(ISNUMBER(Terauda!G31),Terauda!H31,\"\")","v":""},{"$f":"IF(ISTEXT(Terauda!I31),Terauda!I31,\"\")","v":""},""]
[{"$f":"IF(ISNUMBER(Terauda!G32),Terauda!A32,\"\")","v":""},{"$f":"IF(ISNUMBER(Terauda!G32),Terauda!B32,\"\")","v":""},{"$f":"IF(ISNUMBER(Terauda!G32),Terauda!C32,\"\")","v":""},{"$f":"IF(ISNUMBER(Terauda!G32),Terauda!E32,\"\")","v":""},{"$f":"IF(ISNUMBER(Terauda!G32),Terauda!G32,\"\")","v":""},{"$f":"IF(ISNUMBER(Terauda!G32),Terauda!H32,\"\")","v":""},{"$f":"IF(ISTEXT(Terauda!I32),Terauda!I32,\"\")","v":""},""]
[{"$f":"IF(ISNUMBER(Terauda!G33),Terauda!A33,\"\")","v":""},{"$f":"IF(ISNUMBER(Terauda!G33),Terauda!B33,\"\")","v":""},{"$f":"IF(ISNUMBER(Terauda!G33),Terauda!C33,\"\")","v":""},{"$f":"IF(ISNUMBER(Terauda!G33),Terauda!E33,\"\")","v":""},{"$f":"IF(ISNUMBER(Terauda!G33),Terauda!G33,\"\")","v":""},{"$f":"IF(ISNUMBER(Terauda!G33),Terauda!H33,\"\")","v":""},{"$f":"IF(ISTEXT(Terauda!I33),Terauda!I33,\"\")","v":""},""]
[{"$f":"IF(ISNUMBER(Terauda!G34),Terauda!A34,\"\")","v":""},{"$f":"IF(ISNUMBER(Terauda!G34),Terauda!B34,\"\")","v":""},{"$f":"IF(ISNUMBER(Terauda!G34),Terauda!C34,\"\")","v":""},{"$f":"IF(ISNUMBER(Terauda!G34),Terauda!E34,\"\")","v":""},{"$f":"IF(ISNUMBER(Terauda!G34),Terauda!G34,\"\")","v":""},{"$f":"IF(ISNUMBER(Terauda!G34),Terauda!H34,\"\")","v":""},{"$f":"IF(ISTEXT(Terauda!I34),Terauda!I34,\"\")","v":""},""]
[{"$f":"IF(ISNUMBER(Terauda!G35),Terauda!A35,\"\")","v":""},{"$f":"IF(ISNUMBER(Terauda!G35),Terauda!B35,\"\")","v":""},{"$f":"IF(ISNUMBER(Terauda!G35),Terauda!C35,\"\")","v":""},{"$f":"IF(ISNUMBER(Terauda!G35),Terauda!E35,\"\")","v":""},{"$f":"IF(ISNUMBER(Terauda!G35),Terauda!G35,\"\")","v":""},{"$f":"IF(ISNUMBER(Terauda!G35),Terauda!H35,\"\")","v":""},{"$f":"IF(ISTEXT(Terauda!I35),Terauda!I35,\"\")","v":""},""]
[{"$f":"IF(ISNUMBER(Terauda!G36),Terauda!A36,\"\")","v":""},{"$f":"IF(ISNUMBER(Terauda!G36),Terauda!B36,\"\")","v":""},{"$f":"IF(ISNUMBER(Terauda!G36),Terauda!C36,\"\")","v":""},{"$f":"IF(ISNUMBER(Terauda!G36),Terauda!E36,\"\")","v":""},{"$f":"IF(ISNUMBER(Terauda!G36),Terauda!G36,\"\")","v":""},{"$f":"IF(ISNUMBER(Terauda!G36),Terauda!H36,\"\")","v":""},{"$f":"IF(ISTEXT(Terauda!I36),Terauda!I36,\"\")","v":""},""]
[{"$f":"IF(ISNUMBER(Terauda!G37),Terauda!A37,\"\")","v":""},{"$f":"IF(ISNUMBER(Terauda!G37),Terauda!B37,\"\")","v":""},{"$f":"IF(ISNUMBER(Terauda!G37),Terauda!C37,\"\")","v":""},{"$f":"IF(ISNUMBER(Terauda!G37),Terauda!E37,\"\")","v":""},{"$f":"IF(ISNUMBER(Terauda!G37),Terauda!G37,\"\")","v":""},{"$f":"IF(ISNUMBER(Terauda!G37),Terauda!H37,\"\")","v":""},{"$f":"IF(ISTEXT(Terauda!I37),Terauda!I37,\"\")","v":""},""]
[{"$f":"IF(ISNUMBER(Terauda!G38),Terauda!A38,\"\")","v":""},{"$f":"IF(ISNUMBER(Terauda!G38),Terauda!B38,\"\")","v":""},{"$f":"IF(ISNUMBER(Terauda!G38),Terauda!C38,\"\")","v":""},{"$f":"IF(ISNUMBER(Terauda!G38),Terauda!E38,\"\")","v":""},{"$f":"IF(ISNUMBER(Terauda!G38),Terauda!G38,\"\")","v":""},{"$f":"IF(ISNUMBER(Terauda!G38),Terauda!H38,\"\")","v":""},{"$f":"IF(ISTEXT(Terauda!I38),Terauda!I38,\"\")","v":""},""]
[{"$f":"IF(ISNUMBER(Terauda!G39),Terauda!A39,\"\")","v":""},{"$f":"IF(ISNUMBER(Terauda!G39),Terauda!B39,\"\")","v":""},{"$f":"IF(ISNUMBER(Terauda!G39),Terauda!C39,\"\")","v":""},{"$f":"IF(ISNUMBER(Terauda!G39),Terauda!E39,\"\")","v":""},{"$f":"IF(ISNUMBER(Terauda!G39),Terauda!G39,\"\")","v":""},{"$f":"IF(ISNUMBER(Terauda!G39),Terauda!H39,\"\")","v":""},{"$f":"IF(ISTEXT(Terauda!I39),Terauda!I39,\"\")","v":""},""]
[{"$f":"IF(ISNUMBER(Terauda!G40),Terauda!A40,\"\")","v":""},{"$f":"IF(ISNUMBER(Terauda!G40),Terauda!B40,\"\")","v":""},{"$f":"IF(ISNUMBER(Terauda!G40),Terauda!C40,\"\")","v":""},{"$f":"IF(ISNUMBER(Terauda!G40),Terauda!E40,\"\")","v":""},{"$f":"IF(ISNUMBER(Terauda!G40),Terauda!G40,\"\")","v":""},{"$f":"IF(ISNUMBER(Terauda!G40),Terauda!H40,\"\")","v":""},{"$f":"IF(ISTEXT(Terauda!I40),Terauda!I40,\"\")","v":""},""]
[{"$f":"IF(ISNUMBER(Terauda!G41),Terauda!A41,\"\")","v":""},{"$f":"IF(ISNUMBER(Terauda!G41),Terauda!B41,\"\")","v":""},{"$f":"IF(ISNUMBER(Terauda!G41),Terauda!C41,\"\")","v":""},{"$f":"IF(ISNUMBER(Terauda!G41),Terauda!E41,\"\")","v":""},{"$f":"IF(ISNUMBER(Terauda!G41),Terauda!G41,\"\")","v":""},{"$f":"IF(ISNUMBER(Terauda!G41),Terauda!H41,\"\")","v":""},{"$f":"IF(ISTEXT(Terauda!I41),Terauda!I41,\"\")","v":""},""]
[{"$f":"IF(ISNUMBER(Terauda!G42),Terauda!A42,\"\")","v":""},{"$f":"IF(ISNUMBER(Terauda!G42),Terauda!B42,\"\")","v":""},{"$f":"IF(ISNUMBER(Terauda!G42),Terauda!C42,\"\")","v":""},{"$f":"IF(ISNUMBER(Terauda!G42),Terauda!E42,\"\")","v":""},{"$f":"IF(ISNUMBER(Terauda!G42),Terauda!G42,\"\")","v":""},{"$f":"IF(ISNUMBER(Terauda!G42),Terauda!H42,\"\")","v":""},{"$f":"IF(ISTEXT(Terauda!I42),Terauda!I42,\"\")","v":""},""]
[{"$f":"IF(ISNUMBER(Terauda!G43),Terauda!A43,\"\")","v":""},{"$f":"IF(ISNUMBER(Terauda!G43),Terauda!B43,\"\")","v":""},{"$f":"IF(ISNUMBER(Terauda!G43),Terauda!C43,\"\")","v":""},{"$f":"IF(ISNUMBER(Terauda!G43),Terauda!E43,\"\")","v":""},{"$f":"IF(ISNUMBER(Terauda!G43),Terauda!G43,\"\")","v":""},{"$f":"IF(ISNUMBER(Terauda!G43),Terauda!H43,\"\")","v":""},{"$f":"IF(ISTEXT(Terauda!I43),Terauda!I43,\"\")","v":""},""]
[{"$f":"IF(ISNUMBER(Terauda!G44),Terauda!A44,\"\")","v":""},{"$f":"IF(ISNUMBER(Terauda!G44),Terauda!B44,\"\")","v":""},{"$f":"IF(ISNUMBER(Terauda!G44),Terauda!C44,\"\")","v":""},{"$f":"IF(ISNUMBER(Terauda!G44),Terauda!E44,\"\")","v":""},{"$f":"IF(ISNUMBER(Terauda!G44),Terauda!G44,\"\")","v":""},{"$f":"IF(ISNUMBER(Terauda!G44),Terauda!H44,\"\")","v":""},{"$f":"IF(ISTEXT(Terauda!I44),Terauda!I44,\"\")","v":""},""]
[{"$f":"IF(ISNUMBER(Terauda!G45),Terauda!A45,\"\")","v":""},{"$f":"IF(ISNUMBER(Terauda!G45),Terauda!B45,\"\")","v":""},{"$f":"IF(ISNUMBER(Terauda!G45),Terauda!C45,\"\")","v":""},{"$f":"IF(ISNUMBER(Terauda!G45),Terauda!E45,\"\")","v":""},{"$f":"IF(ISNUMBER(Terauda!G45),Terauda!G45,\"\")","v":""},{"$f":"IF(ISNUMBER(Terauda!G45),Terauda!H45,\"\")","v":""},{"$f":"IF(ISTEXT(Terauda!I45),Terauda!I45,\"\")","v":""},""]
[{"$f":"IF(ISNUMBER(Terauda!G46),Terauda!A46,\"\")","v":""},{"$f":"IF(ISNUMBER(Terauda!G46),Terauda!B46,\"\")","v":""},{"$f":"IF(ISNUMBER(Terauda!G46),Terauda!C46,\"\")","v":""},{"$f":"IF(ISNUMBER(Terauda!G46),Terauda!E46,\"\")","v":""},{"$f":"IF(ISNUMBER(Terauda!G46),Terauda!G46,\"\")","v":""},{"$f":"IF(ISNUMBER(Terauda!G46),Terauda!H46,\"\")","v":""},{"$f":"IF(ISTEXT(Terauda!I46),Terauda!I46,\"\")","v":""},""]
[{"$f":"IF(ISNUMBER(Terauda!G47),Terauda!A47,\"\")","v":""},{"$f":"IF(ISNUMBER(Terauda!G47),Terauda!B47,\"\")","v":""},{"$f":"IF(ISNUMBER(Terauda!G47),Terauda!C47,\"\")","v":""},{"$f":"IF(ISNUMBER(Terauda!G47),Terauda!E47,\"\")","v":""},{"$f":"IF(ISNUMBER(Terauda!G47),Terauda!G47,\"\")","v":""},{"$f":"IF(ISNUMBER(Terauda!G47),Terauda!H47,\"\")","v":""},{"$f":"IF(ISTEXT(Terauda!I47),Terauda!I47,\"\")","v":""},""]
[{"$f":"IF(ISNUMBER(Terauda!G48),Terauda!A48,\"\")","v":""},{"$f":"IF(ISNUMBER(Terauda!G48),Terauda!B48,\"\")","v":""},{"$f":"IF(ISNUMBER(Terauda!G48),Terauda!C48,\"\")","v":""},{"$f":"IF(ISNUMBER(Terauda!G48),Terauda!E48,\"\")","v":""},{"$f":"IF(ISNUMBER(Terauda!G48),Terauda!G48,\"\")","v":""},{"$f":"IF(ISNUMBER(Terauda!G48),Terauda!H48,\"\")","v":""},{"$f":"IF(ISTEXT(Terauda!I48),Terauda!I48,\"\")","v":""},""]
[{"$f":"IF(ISNUMBER(Terauda!G49),Terauda!A49,\"\")","v":""},{"$f":"IF(ISNUMBER(Terauda!G49),Terauda!B49,\"\")","v":""},{"$f":"IF(ISNUMBER(Terauda!G49),Terauda!C49,\"\")","v":""},{"$f":"IF(ISNUMBER(Terauda!G49),Terauda!E49,\"\")","v":""},{"$f":"IF(ISNUMBER(Terauda!G49),Terauda!G49,\"\")","v":""},{"$f":"IF(ISNUMBER(Terauda!G49),Terauda!H49,\"\")","v":""},{"$f":"IF(ISTEXT(Terauda!I49),Terauda!I49,\"\")","v":""},""]
[{"$f":"IF(ISNUMBER(Terauda!G50),Terauda!A50,\"\")","v":""},{"$f":"IF(ISNUMBER(Terauda!G50),Terauda!B50,\"\")","v":""},{"$f":"IF(ISNUMBER(Terauda!G50),Terauda!C50,\"\")","v":""},{"$f":"IF(ISNUMBER(Terauda!G50),Terauda!E50,\"\")","v":""},{"$f":"IF(ISNUMBER(Terauda!G50),Terauda!G50,\"\")","v":""},{"$f":"IF(ISNUMBER(Terauda!G50),Terauda!H50,\"\")","v":""},{"$f":"IF(ISTEXT(Terauda!I50),Terauda!I50,\"\")","v":""},""]
[{"$f":"IF(ISNUMBER(Terauda!G51),Terauda!A51,\"\")","v":""},{"$f":"IF(ISNUMBER(Terauda!G51),Terauda!B51,\"\")","v":""},{"$f":"IF(ISNUMBER(Terauda!G51),Terauda!C51,\"\")","v":""},{"$f":"IF(ISNUMBER(Terauda!G51),Terauda!E51,\"\")","v":""},{"$f":"IF(ISNUMBER(Terauda!G51),Terauda!G51,\"\")","v":""},{"$f":"IF(ISNUMBER(Terauda!G51),Terauda!H51,\"\")","v":""},{"$f":"IF(ISTEXT(Terauda!I51),Terauda!I51,\"\")","v":""},""]
[{"$f":"IF(ISNUMBER(Terauda!G52),Terauda!A52,\"\")","v":""},{"$f":"IF(ISNUMBER(Terauda!G52),Terauda!B52,\"\")","v":""},{"$f":"IF(ISNUMBER(Terauda!G52),Terauda!C52,\"\")","v":""},{"$f":"IF(ISNUMBER(Terauda!G52),Terauda!E52,\"\")","v":""},{"$f":"IF(ISNUMBER(Terauda!G52),Terauda!G52,\"\")","v":""},{"$f":"IF(ISNUMBER(Terauda!G52),Terauda!H52,\"\")","v":""},{"$f":"IF(ISTEXT(Terauda!I52),Terauda!I52,\"\")","v":""},""]
[{"$f":"IF(ISNUMBER(Terauda!G53),Terauda!A53,\"\")","v":""},{"$f":"IF(ISNUMBER(Terauda!G53),Terauda!B53,\"\")","v":""},{"$f":"IF(ISNUMBER(Terauda!G53),Terauda!C53,\"\")","v":""},{"$f":"IF(ISNUMBER(Terauda!G53),Terauda!E53,\"\")","v":""},{"$f":"IF(ISNUMBER(Terauda!G53),Terauda!G53,\"\")","v":""},{"$f":"IF(ISNUMBER(Terauda!G53),Terauda!H53,\"\")","v":""},{"$f":"IF(ISTEXT(Terauda!I53),Terauda!I53,\"\")","v":""},""]
[{"$f":"IF(ISNUMBER(Terauda!G54),Terauda!A54,\"\")","v":""},{"$f":"IF(ISNUMBER(Terauda!G54),Terauda!B54,\"\")","v":""},{"$f":"IF(ISNUMBER(Terauda!G54),Terauda!C54,\"\")","v":""},{"$f":"IF(ISNUMBER(Terauda!G54),Terauda!E54,\"\")","v":""},{"$f":"IF(ISNUMBER(Terauda!G54),Terauda!G54,\"\")","v":""},{"$f":"IF(ISNUMBER(Terauda!G54),Terauda!H54,\"\")","v":""},{"$f":"IF(ISTEXT(Terauda!I54),Terauda!I54,\"\")","v":""},""]
[{"$f":"IF(ISNUMBER(Terauda!G55),Terauda!A55,\"\")","v":""},{"$f":"IF(ISNUMBER(Terauda!G55),Terauda!B55,\"\")","v":""},{"$f":"IF(ISNUMBER(Terauda!G55),Terauda!C55,\"\")","v":""},{"$f":"IF(ISNUMBER(Terauda!G55),Terauda!E55,\"\")","v":""},{"$f":"IF(ISNUMBER(Terauda!G55),Terauda!G55,\"\")","v":""},{"$f":"IF(ISNUMBER(Terauda!G55),Terauda!H55,\"\")","v":""},{"$f":"IF(ISTEXT(Terauda!I55),Terauda!I55,\"\")","v":""},""]
[{"$f":"IF(ISNUMBER(Terauda!G56),Terauda!A56,\"\")","v":""},{"$f":"IF(ISNUMBER(Terauda!G56),Terauda!B56,\"\")","v":""},{"$f":"IF(ISNUMBER(Terauda!G56),Terauda!C56,\"\")","v":""},{"$f":"IF(ISNUMBER(Terauda!G56),Terauda!E56,\"\")","v":""},{"$f":"IF(ISNUMBER(Terauda!G56),Terauda!G56,\"\")","v":""},{"$f":"IF(ISNUMBER(Terauda!G56),Terauda!H56,\"\")","v":""},{"$f":"IF(ISTEXT(Terauda!I56),Terauda!I56,\"\")","v":""},""]
[{"$f":"IF(ISNUMBER(Terauda!G57),Terauda!A57,\"\")","v":""},{"$f":"IF(ISNUMBER(Terauda!G57),Terauda!B57,\"\")","v":""},{"$f":"IF(ISNUMBER(Terauda!G57),Terauda!C57,\"\")","v":""},{"$f":"IF(ISNUMBER(Terauda!G57),Terauda!E57,\"\")","v":""},{"$f":"IF(ISNUMBER(Terauda!G57),Terauda!G57,\"\")","v":""},{"$f":"IF(ISNUMBER(Terauda!G57),Terauda!H57,\"\")","v":""},{"$f":"IF(ISTEXT(Terauda!I57),Terauda!I57,\"\")","v":""},""]
[{"$f":"IF(ISNUMBER(Terauda!G58),Terauda!A58,\"\")","v":""},{"$f":"IF(ISNUMBER(Terauda!G58),Terauda!B58,\"\")","v":""},{"$f":"IF(ISNUMBER(Terauda!G58),Terauda!C58,\"\")","v":""},{"$f":"IF(ISNUMBER(Terauda!G58),Terauda!E58,\"\")","v":""},{"$f":"IF(ISNUMBER(Terauda!G58),Terauda!G58,\"\")","v":""},{"$f":"IF(ISNUMBER(Terauda!G58),Terauda!H58,\"\")","v":""},{"$f":"IF(ISTEXT(Terauda!I58),Terauda!I58,\"\")","v":""},""]
[{"$f":"IF(ISNUMBER(Terauda!G59),Terauda!A59,\"\")","v":""},{"$f":"IF(ISNUMBER(Terauda!G59),Terauda!B59,\"\")","v":""},{"$f":"IF(ISNUMBER(Terauda!G59),Terauda!C59,\"\")","v":""},{"$f":"IF(ISNUMBER(Terauda!G59),Terauda!E59,\"\")","v":""},{"$f":"IF(ISNUMBER(Terauda!G59),Terauda!G59,\"\")","v":""},{"$f":"IF(ISNUMBER(Terauda!G59),Terauda!H59,\"\")","v":""},{"$f":"IF(ISTEXT(Terauda!I59),Terauda!I59,\"\")","v":""},""]
[{"$f":"IF(ISNUMBER(Terauda!G60),Terauda!A60,\"\")","v":""},{"$f":"IF(ISNUMBER(Terauda!G60),Terauda!B60,\"\")","v":""},{"$f":"IF(ISNUMBER(Terauda!G60),Terauda!C60,\"\")","v":""},{"$f":"IF(ISNUMBER(Terauda!G60),Terauda!E60,\"\")","v":""},{"$f":"IF(ISNUMBER(Terauda!G60),Terauda!G60,\"\")","v":""},{"$f":"IF(ISNUMBER(Terauda!G60),Terauda!H60,\"\")","v":""},{"$f":"IF(ISTEXT(Terauda!I60),Terauda!I60,\"\")","v":""},""]
[{"$f":"IF(ISNUMBER(Terauda!G61),Terauda!A61,\"\")","v":""},{"$f":"IF(ISNUMBER(Terauda!G61),Terauda!B61,\"\")","v":""},{"$f":"IF(ISNUMBER(Terauda!G61),Terauda!C61,\"\")","v":""},{"$f":"IF(ISNUMBER(Terauda!G61),Terauda!E61,\"\")","v":""},{"$f":"IF(ISNUMBER(Terauda!G61),Terauda!G61,\"\")","v":""},{"$f":"IF(ISNUMBER(Terauda!G61),Terauda!H61,\"\")","v":""},{"$f":"IF(ISTEXT(Terauda!I61),Terauda!I61,\"\")","v":""},""]
[{"$f":"IF(ISNUMBER(Terauda!G62),Terauda!A62,\"\")","v":""},{"$f":"IF(ISNUMBER(Terauda!G62),Terauda!B62,\"\")","v":""},{"$f":"IF(ISNUMBER(Terauda!G62),Terauda!C62,\"\")","v":""},{"$f":"IF(ISNUMBER(Terauda!G62),Terauda!E62,\"\")","v":""},{"$f":"IF(ISNUMBER(Terauda!G62),Terauda!G62,\"\")","v":""},{"$f":"IF(ISNUMBER(Terauda!G62),Terauda!H62,\"\")","v":""},{"$f":"IF(ISTEXT(Terauda!I62),Terauda!I62,\"\")","v":""},""]
[{"$f":"IF(ISNUMBER(Terauda!G63),Terauda!A63,\"\")","v":""},{"$f":"IF(ISNUMBER(Terauda!G63),Terauda!B63,\"\")","v":""},{"$f":"IF(ISNUMBER(Terauda!G63),Terauda!C63,\"\")","v":""},{"$f":"IF(ISNUMBER(Terauda!G63),Terauda!E63,\"\")","v":""},{"$f":"IF(ISNUMBER(Terauda!G63),Terauda!G63,\"\")","v":""},{"$f":"IF(ISNUMBER(Terauda!G63),Terauda!H63,\"\")","v":""},{"$f":"IF(ISTEXT(Terauda!I63),Terauda!I63,\"\")","v":""},""]
[{"$f":"IF(ISNUMBER(Terauda!G64),Terauda!A64,\"\")","v":""},{"$f":"IF(ISNUMBER(Terauda!G64),Terauda!B64,\"\")","v":""},{"$f":"IF(ISNUMBER(Terauda!G64),Terauda!C64,\"\")","v":""},{"$f":"IF(ISNUMBER(Terauda!G64),Terauda!E64,\"\")","v":""},{"$f":"IF(ISNUMBER(Terauda!G64),Terauda!G64,\"\")","v":""},{"$f":"IF(ISNUMBER(Terauda!G64),Terauda!H64,\"\")","v":""},{"$f":"IF(ISTEXT(Terauda!I64),Terauda!I64,\"\")","v":""},""]
[{"$f":"IF(ISNUMBER(Terauda!G65),Terauda!A65,\"\")","v":""},{"$f":"IF(ISNUMBER(Terauda!G65),Terauda!B65,\"\")","v":""},{"$f":"IF(ISNUMBER(Terauda!G65),Terauda!C65,\"\")","v":""},{"$f":"IF(ISNUMBER(Terauda!G65),Terauda!E65,\"\")","v":""},{"$f":"IF(ISNUMBER(Terauda!G65),Terauda!G65,\"\")","v":""},{"$f":"IF(ISNUMBER(Terauda!G65),Terauda!H65,\"\")","v":""},{"$f":"IF(ISTEXT(Terauda!I65),Terauda!I65,\"\")","v":""},""]
[{"$f":"IF(ISNUMBER(Terauda!G66),Terauda!A66,\"\")","v":""},{"$f":"IF(ISNUMBER(Terauda!G66),Terauda!B66,\"\")","v":""},{"$f":"IF(ISNUMBER(Terauda!G66),Terauda!C66,\"\")","v":""},{"$f":"IF(ISNUMBER(Terauda!G66),Terauda!E66,\"\")","v":""},{"$f":"IF(ISNUMBER(Terauda!G66),Terauda!G66,\"\")","v":""},{"$f":"IF(ISNUMBER(Terauda!G66),Terauda!H66,\"\")","v":""},{"$f":"IF(ISTEXT(Terauda!I66),Terauda!I66,\"\")","v":""},""]
[{"$f":"IF(ISNUMBER(Terauda!G67),Terauda!A67,\"\")","v":""},{"$f":"IF(ISNUMBER(Terauda!G67),Terauda!B67,\"\")","v":""},{"$f":"IF(ISNUMBER(Terauda!G67),Terauda!C67,\"\")","v":""},{"$f":"IF(ISNUMBER(Terauda!G67),Terauda!E67,\"\")","v":""},{"$f":"IF(ISNUMBER(Terauda!G67),Terauda!G67,\"\")","v":""},{"$f":"IF(ISNUMBER(Terauda!G67),Terauda!H67,\"\")","v":""},{"$f":"IF(ISTEXT(Terauda!I67),Terauda!I67,\"\")","v":""},""]
[{"$f":"IF(ISNUMBER(Terauda!G68),Terauda!A68,\"\")","v":""},{"$f":"IF(ISNUMBER(Terauda!G68),Terauda!B68,\"\")","v":""},{"$f":"IF(ISNUMBER(Terauda!G68),Terauda!C68,\"\")","v":""},{"$f":"IF(ISNUMBER(Terauda!G68),Terauda!E68,\"\")","v":""},{"$f":"IF(ISNUMBER(Terauda!G68),Terauda!G68,\"\")","v":""},{"$f":"IF(ISNUMBER(Terauda!G68),Terauda!H68,\"\")","v":""},{"$f":"IF(ISTEXT(Terauda!I68),Terauda!I68,\"\")","v":""},""]
[{"$f":"IF(ISNUMBER(Terauda!G69),Terauda!A69,\"\")","v":""},{"$f":"IF(ISNUMBER(Terauda!G69),Terauda!B69,\"\")","v":""},{"$f":"IF(ISNUMBER(Terauda!G69),Terauda!C69,\"\")","v":""},{"$f":"IF(ISNUMBER(Terauda!G69),Terauda!E69,\"\")","v":""},{"$f":"IF(ISNUMBER(Terauda!G69),Terauda!G69,\"\")","v":""},{"$f":"IF(ISNUMBER(Terauda!G69),Terauda!H69,\"\")","v":""},{"$f":"IF(ISTEXT(Terauda!I69),Terauda!I69,\"\")","v":""},{"$f":"IF(ISNUMBER(E787),\"yes\",\"\")","v":""}]
[{"$f":"IF(ISNUMBER(Terauda!G70),Terauda!A70,\"\")","v":""},{"$f":"IF(ISNUMBER(Terauda!G70),Terauda!B70,\"\")","v":""},{"$f":"IF(ISNUMBER(Terauda!G70),Terauda!C70,\"\")","v":""},{"$f":"IF(ISNUMBER(Terauda!G70),Terauda!E70,\"\")","v":""},{"$f":"IF(ISNUMBER(Terauda!G70),Terauda!G70,\"\")","v":""},{"$f":"IF(ISNUMBER(Terauda!G70),Terauda!H70,\"\")","v":""},{"$f":"IF(ISTEXT(Terauda!I70),Terauda!I70,\"\")","v":""},""]
[{"$f":"IF(ISNUMBER(Terauda!G71),Terauda!A71,\"\")","v":""},{"$f":"IF(ISNUMBER(Terauda!G71),Terauda!B71,\"\")","v":""},{"$f":"IF(ISNUMBER(Terauda!G71),Terauda!C71,\"\")","v":""},{"$f":"IF(ISNUMBER(Terauda!G71),Terauda!E71,\"\")","v":""},{"$f":"IF(ISNUMBER(Terauda!G71),Terauda!G71,\"\")","v":""},{"$f":"IF(ISNUMBER(Terauda!G71),Terauda!H71,\"\")","v":""},{"$f":"IF(ISTEXT(Terauda!I71),Terauda!I71,\"\")","v":""},""]
[{"$f":"IF(ISNUMBER(Terauda!G72),Terauda!A72,\"\")","v":""},{"$f":"IF(ISNUMBER(Terauda!G72),Terauda!B72,\"\")","v":""},{"$f":"IF(ISNUMBER(Terauda!G72),Terauda!C72,\"\")","v":""},{"$f":"IF(ISNUMBER(Terauda!G72),Terauda!E72,\"\")","v":""},{"$f":"IF(ISNUMBER(Terauda!G72),Terauda!G72,\"\")","v":""},{"$f":"IF(ISNUMBER(Terauda!G72),Terauda!H72,\"\")","v":""},{"$f":"IF(ISTEXT(Terauda!I72),Terauda!I72,\"\")","v":""},""]
[{"$f":"IF(ISNUMBER(Terauda!G73),Terauda!A73,\"\")","v":""},{"$f":"IF(ISNUMBER(Terauda!G73),Terauda!B73,\"\")","v":""},{"$f":"IF(ISNUMBER(Terauda!G73),Terauda!C73,\"\")","v":""},{"$f":"IF(ISNUMBER(Terauda!G73),Terauda!E73,\"\")","v":""},{"$f":"IF(ISNUMBER(Terauda!G73),Terauda!G73,\"\")","v":""},{"$f":"IF(ISNUMBER(Terauda!G73),Terauda!H73,\"\")","v":""},{"$f":"IF(ISTEXT(Terauda!I73),Terauda!I73,\"\")","v":""},""]
[{"$f":"IF(ISNUMBER(Terauda!G74),Terauda!A74,\"\")","v":""},{"$f":"IF(ISNUMBER(Terauda!G74),Terauda!B74,\"\")","v":""},{"$f":"IF(ISNUMBER(Terauda!G74),Terauda!C74,\"\")","v":""},{"$f":"IF(ISNUMBER(Terauda!G74),Terauda!E74,\"\")","v":""},{"$f":"IF(ISNUMBER(Terauda!G74),Terauda!G74,\"\")","v":""},{"$f":"IF(ISNUMBER(Terauda!G74),Terauda!H74,\"\")","v":""},{"$f":"IF(ISTEXT(Terauda!I74),Terauda!I74,\"\")","v":""},""]
[{"$f":"IF(ISNUMBER(Terauda!G75),Terauda!A75,\"\")","v":""},{"$f":"IF(ISNUMBER(Terauda!G75),Terauda!B75,\"\")","v":""},{"$f":"IF(ISNUMBER(Terauda!G75),Terauda!C75,\"\")","v":""},{"$f":"IF(ISNUMBER(Terauda!G75),Terauda!E75,\"\")","v":""},{"$f":"IF(ISNUMBER(Terauda!G75),Terauda!G75,\"\")","v":""},{"$f":"IF(ISNUMBER(Terauda!G75),Terauda!H75,\"\")","v":""},{"$f":"IF(ISTEXT(Terauda!I75),Terauda!I75,\"\")","v":""},""]
[{"$f":"IF(ISNUMBER(Terauda!G76),Terauda!A76,\"\")","v":""},{"$f":"IF(ISNUMBER(Terauda!G76),Terauda!B76,\"\")","v":""},{"$f":"IF(ISNUMBER(Terauda!G76),Terauda!C76,\"\")","v":""},{"$f":"IF(ISNUMBER(Terauda!G76),Terauda!E76,\"\")","v":""},{"$f":"IF(ISNUMBER(Terauda!G76),Terauda!G76,\"\")","v":""},{"$f":"IF(ISNUMBER(Terauda!G76),Terauda!H76,\"\")","v":""},{"$f":"IF(ISTEXT(Terauda!I76),Terauda!I76,\"\")","v":""},""]
[{"$f":"IF(ISNUMBER(Terauda!G77),Terauda!A77,\"\")","v":""},{"$f":"IF(ISNUMBER(Terauda!G77),Terauda!B77,\"\")","v":""},{"$f":"IF(ISNUMBER(Terauda!G77),Terauda!C77,\"\")","v":""},{"$f":"IF(ISNUMBER(Terauda!G77),Terauda!E77,\"\")","v":""},{"$f":"IF(ISNUMBER(Terauda!G77),Terauda!G77,\"\")","v":""},{"$f":"IF(ISNUMBER(Terauda!G77),Terauda!H77,\"\")","v":""},{"$f":"IF(ISTEXT(Terauda!I77),Terauda!I77,\"\")","v":""},""]
[{"$f":"IF(ISNUMBER(Terauda!G78),Terauda!A78,\"\")","v":""},{"$f":"IF(ISNUMBER(Terauda!G78),Terauda!B78,\"\")","v":""},{"$f":"IF(ISNUMBER(Terauda!G78),Terauda!C78,\"\")","v":""},{"$f":"IF(ISNUMBER(Terauda!G78),Terauda!E78,\"\")","v":""},{"$f":"IF(ISNUMBER(Terauda!G78),Terauda!G78,\"\")","v":""},{"$f":"IF(ISNUMBER(Terauda!G78),Terauda!H78,\"\")","v":""},{"$f":"IF(ISTEXT(Terauda!I78),Terauda!I78,\"\")","v":""},""]
[{"$f":"IF(ISNUMBER(Terauda!G79),Terauda!A79,\"\")","v":""},{"$f":"IF(ISNUMBER(Terauda!G79),Terauda!B79,\"\")","v":""},{"$f":"IF(ISNUMBER(Terauda!G79),Terauda!C79,\"\")","v":""},{"$f":"IF(ISNUMBER(Terauda!G79),Terauda!E79,\"\")","v":""},{"$f":"IF(ISNUMBER(Terauda!G79),Terauda!G79,\"\")","v":""},{"$f":"IF(ISNUMBER(Terauda!G79),Terauda!H79,\"\")","v":""},{"$f":"IF(ISTEXT(Terauda!I79),Terauda!I79,\"\")","v":""},""]
[{"$f":"IF(ISNUMBER(Terauda!G80),Terauda!A80,\"\")","v":""},{"$f":"IF(ISNUMBER(Terauda!G80),Terauda!B80,\"\")","v":""},{"$f":"IF(ISNUMBER(Terauda!G80),Terauda!C80,\"\")","v":""},{"$f":"IF(ISNUMBER(Terauda!G80),Terauda!E80,\"\")","v":""},{"$f":"IF(ISNUMBER(Terauda!G80),Terauda!G80,\"\")","v":""},{"$f":"IF(ISNUMBER(Terauda!G80),Terauda!H80,\"\")","v":""},{"$f":"IF(ISTEXT(Terauda!I80),Terauda!I80,\"\")","v":""},""]
[{"$f":"IF(ISNUMBER(Terauda!G81),Terauda!A81,\"\")","v":""},{"$f":"IF(ISNUMBER(Terauda!G81),Terauda!B81,\"\")","v":""},{"$f":"IF(ISNUMBER(Terauda!G81),Terauda!C81,\"\")","v":""},{"$f":"IF(ISNUMBER(Terauda!G81),Terauda!E81,\"\")","v":""},{"$f":"IF(ISNUMBER(Terauda!G81),Terauda!G81,\"\")","v":""},{"$f":"IF(ISNUMBER(Terauda!G81),Terauda!H81,\"\")","v":""},{"$f":"IF(ISTEXT(Terauda!I81),Terauda!I81,\"\")","v":""},""]
[{"$f":"IF(ISNUMBER(Terauda!G82),Terauda!A82,\"\")","v":""},{"$f":"IF(ISNUMBER(Terauda!G82),Terauda!B82,\"\")","v":""},{"$f":"IF(ISNUMBER(Terauda!G82),Terauda!C82,\"\")","v":""},{"$f":"IF(ISNUMBER(Terauda!G82),Terauda!E82,\"\")","v":""},{"$f":"IF(ISNUMBER(Terauda!G82),Terauda!G82,\"\")","v":""},{"$f":"IF(ISNUMBER(Terauda!G82),Terauda!H82,\"\")","v":""},{"$f":"IF(ISTEXT(Terauda!I82),Terauda!I82,\"\")","v":""},""]
[{"$f":"IF(ISNUMBER(Terauda!G83),Terauda!A83,\"\")","v":""},{"$f":"IF(ISNUMBER(Terauda!G83),Terauda!B83,\"\")","v":""},{"$f":"IF(ISNUMBER(Terauda!G83),Terauda!C83,\"\")","v":""},{"$f":"IF(ISNUMBER(Terauda!G83),Terauda!E83,\"\")","v":""},{"$f":"IF(ISNUMBER(Terauda!G83),Terauda!G83,\"\")","v":""},{"$f":"IF(ISNUMBER(Terauda!G83),Terauda!H83,\"\")","v":""},{"$f":"IF(ISTEXT(Terauda!I83),Terauda!I83,\"\")","v":""},""]
[{"$f":"IF(ISNUMBER(Terauda!G84),Terauda!A84,\"\")","v":""},{"$f":"IF(ISNUMBER(Terauda!G84),Terauda!B84,\"\")","v":""},{"$f":"IF(ISNUMBER(Terauda!G84),Terauda!C84,\"\")","v":""},{"$f":"IF(ISNUMBER(Terauda!G84),Terauda!E84,\"\")","v":""},{"$f":"IF(ISNUMBER(Terauda!G84),Terauda!G84,\"\")","v":""},{"$f":"IF(ISNUMBER(Terauda!G84),Terauda!H84,\"\")","v":""},{"$f":"IF(ISTEXT(Terauda!I84),Terauda!I84,\"\")","v":""},""]
[{"$f":"IF(ISNUMBER(Terauda!G85),Terauda!A85,\"\")","v":""},{"$f":"IF(ISNUMBER(Terauda!G85),Terauda!B85,\"\")","v":""},{"$f":"IF(ISNUMBER(Terauda!G85),Terauda!C85,\"\")","v":""},{"$f":"IF(ISNUMBER(Terauda!G85),Terauda!E85,\"\")","v":""},{"$f":"IF(ISNUMBER(Terauda!G85),Terauda!G85,\"\")","v":""},{"$f":"IF(ISNUMBER(Terauda!G85),Terauda!H85,\"\")","v":""},{"$f":"IF(ISTEXT(Terauda!I85),Terauda!I85,\"\")","v":""},""]
[{"$f":"IF(ISNUMBER(Terauda!G86),Terauda!A86,\"\")","v":""},{"$f":"IF(ISNUMBER(Terauda!G86),Terauda!B86,\"\")","v":""},{"$f":"IF(ISNUMBER(Terauda!G86),Terauda!C86,\"\")","v":""},{"$f":"IF(ISNUMBER(Terauda!G86),Terauda!E86,\"\")","v":""},{"$f":"IF(ISNUMBER(Terauda!G86),Terauda!G86,\"\")","v":""},{"$f":"IF(ISNUMBER(Terauda!G86),Terauda!H86,\"\")","v":""},{"$f":"IF(ISTEXT(Terauda!I86),Terauda!I86,\"\")","v":""},""]
[{"$f":"IF(ISNUMBER(Terauda!G87),Terauda!A87,\"\")","v":""},{"$f":"IF(ISNUMBER(Terauda!G87),Terauda!B87,\"\")","v":""},{"$f":"IF(ISNUMBER(Terauda!G87),Terauda!C87,\"\")","v":""},{"$f":"IF(ISNUMBER(Terauda!G87),Terauda!E87,\"\")","v":""},{"$f":"IF(ISNUMBER(Terauda!G87),Terauda!G87,\"\")","v":""},{"$f":"IF(ISNUMBER(Terauda!G87),Terauda!H87,\"\")","v":""},{"$f":"IF(ISTEXT(Terauda!I87),Terauda!I87,\"\")","v":""},""]
[{"$f":"IF(ISNUMBER(Terauda!G88),Terauda!A88,\"\")","v":""},{"$f":"IF(ISNUMBER(Terauda!G88),Terauda!B88,\"\")","v":""},{"$f":"IF(ISNUMBER(Terauda!G88),Terauda!C88,\"\")","v":""},{"$f":"IF(ISNUMBER(Terauda!G88),Terauda!E88,\"\")","v":""},{"$f":"IF(ISNUMBER(Terauda!G88),Terauda!G88,\"\")","v":""},{"$f":"IF(ISNUMBER(Terauda!G88),Terauda!H88,\"\")","v":""},{"$f":"IF(ISTEXT(Terauda!I88),Terauda!I88,\"\")","v":""},""]
[{"$f":"IF(ISNUMBER(Terauda!G89),Terauda!A89,\"\")","v":""},{"$f":"IF(ISNUMBER(Terauda!G89),Terauda!B89,\"\")","v":""},{"$f":"IF(ISNUMBER(Terauda!G89),Terauda!C89,\"\")","v":""},{"$f":"IF(ISNUMBER(Terauda!G89),Terauda!E89,\"\")","v":""},{"$f":"IF(ISNUMBER(Terauda!G89),Terauda!G89,\"\")","v":""},{"$f":"IF(ISNUMBER(Terauda!G89),Terauda!H89,\"\")","v":""},{"$f":"IF(ISTEXT(Terauda!I89),Terauda!I89,\"\")","v":""},""]
[{"$f":"IF(ISNUMBER(Terauda!G90),Terauda!A90,\"\")","v":""},{"$f":"IF(ISNUMBER(Terauda!G90),Terauda!B90,\"\")","v":""},{"$f":"IF(ISNUMBER(Terauda!G90),Terauda!C90,\"\")","v":""},{"$f":"IF(ISNUMBER(Terauda!G90),Terauda!E90,\"\")","v":""},{"$f":"IF(ISNUMBER(Terauda!G90),Terauda!G90,\"\")","v":""},{"$f":"IF(ISNUMBER(Terauda!G90),Terauda!H90,\"\")","v":""},{"$f":"IF(ISTEXT(Terauda!I90),Terauda!I90,\"\")","v":""},""]
[{"$f":"IF(ISNUMBER(Terauda!G91),Terauda!A91,\"\")","v":""},{"$f":"IF(ISNUMBER(Terauda!G91),Terauda!B91,\"\")","v":""},{"$f":"IF(ISNUMBER(Terauda!G91),Terauda!C91,\"\")","v":""},{"$f":"IF(ISNUMBER(Terauda!G91),Terauda!E91,\"\")","v":""},{"$f":"IF(ISNUMBER(Terauda!G91),Terauda!G91,\"\")","v":""},{"$f":"IF(ISNUMBER(Terauda!G91),Terauda!H91,\"\")","v":""},{"$f":"IF(ISTEXT(Terauda!I91),Terauda!I91,\"\")","v":""},""]
[{"$f":"IF(ISNUMBER(Terauda!G92),Terauda!A92,\"\")","v":""},{"$f":"IF(ISNUMBER(Terauda!G92),Terauda!B92,\"\")","v":""},{"$f":"IF(ISNUMBER(Terauda!G92),Terauda!C92,\"\")","v":""},{"$f":"IF(ISNUMBER(Terauda!G92),Terauda!E92,\"\")","v":""},{"$f":"IF(ISNUMBER(Terauda!G92),Terauda!G92,\"\")","v":""},{"$f":"IF(ISNUMBER(Terauda!G92),Terauda!H92,\"\")","v":""},{"$f":"IF(ISTEXT(Terauda!I92),Terauda!I92,\"\")","v":""},""]
[{"$f":"IF(ISNUMBER(Terauda!G93),Terauda!A93,\"\")","v":""},{"$f":"IF(ISNUMBER(Terauda!G93),Terauda!B93,\"\")","v":""},{"$f":"IF(ISNUMBER(Terauda!G93),Terauda!C93,\"\")","v":""},{"$f":"IF(ISNUMBER(Terauda!G93),Terauda!E93,\"\")","v":""},{"$f":"IF(ISNUMBER(Terauda!G93),Terauda!G93,\"\")","v":""},{"$f":"IF(ISNUMBER(Terauda!G93),Terauda!H93,\"\")","v":""},{"$f":"IF(ISTEXT(Terauda!I93),Terauda!I93,\"\")","v":""},""]
[{"$f":"IF(ISNUMBER(Terauda!G94),Terauda!A94,\"\")","v":""},{"$f":"IF(ISNUMBER(Terauda!G94),Terauda!B94,\"\")","v":""},{"$f":"IF(ISNUMBER(Terauda!G94),Terauda!C94,\"\")","v":""},{"$f":"IF(ISNUMBER(Terauda!G94),Terauda!E94,\"\")","v":""},{"$f":"IF(ISNUMBER(Terauda!G94),Terauda!G94,\"\")","v":""},{"$f":"IF(ISNUMBER(Terauda!G94),Terauda!H94,\"\")","v":""},{"$f":"IF(ISTEXT(Terauda!I94),Terauda!I94,\"\")","v":""},""]
[{"$f":"IF(ISNUMBER(Terauda!G95),Terauda!A95,\"\")","v":""},{"$f":"IF(ISNUMBER(Terauda!G95),Terauda!B95,\"\")","v":""},{"$f":"IF(ISNUMBER(Terauda!G95),Terauda!C95,\"\")","v":""},{"$f":"IF(ISNUMBER(Terauda!G95),Terauda!E95,\"\")","v":""},{"$f":"IF(ISNUMBER(Terauda!G95),Terauda!G95,\"\")","v":""},{"$f":"IF(ISNUMBER(Terauda!G95),Terauda!H95,\"\")","v":""},{"$f":"IF(ISTEXT(Terauda!I95),Terauda!I95,\"\")","v":""},""]
[{"$f":"IF(ISNUMBER(Terauda!G96),Terauda!A96,\"\")","v":""},{"$f":"IF(ISNUMBER(Terauda!G96),Terauda!B96,\"\")","v":""},{"$f":"IF(ISNUMBER(Terauda!G96),Terauda!C96,\"\")","v":""},{"$f":"IF(ISNUMBER(Terauda!G96),Terauda!E96,\"\")","v":""},{"$f":"IF(ISNUMBER(Terauda!G96),Terauda!G96,\"\")","v":""},{"$f":"IF(ISNUMBER(Terauda!G96),Terauda!H96,\"\")","v":""},{"$f":"IF(ISTEXT(Terauda!I96),Terauda!I96,\"\")","v":""},""]
[{"$f":"IF(ISNUMBER(Terauda!G97),Terauda!A97,\"\")","v":""},{"$f":"IF(ISNUMBER(Terauda!G97),Terauda!B97,\"\")","v":""},{"$f":"IF(ISNUMBER(Terauda!G97),Terauda!C97,\"\")","v":""},{"$f":"IF(ISNUMBER(Terauda!G97),Terauda!E97,\"\")","v":""},{"$f":"IF(ISNUMBER(Terauda!G97),Terauda!G97,\"\")","v":""},{"$f":"IF(ISNUMBER(Terauda!G97),Terauda!H97,\"\")","v":""},{"$f":"IF(ISTEXT(Terauda!I97),Terauda!I97,\"\")","v":""},""]
[{"$f":"IF(ISNUMBER(Terauda!G98),Terauda!A98,\"\")","v":""},{"$f":"IF(ISNUMBER(Terauda!G98),Terauda!B98,\"\")","v":""},{"$f":"IF(ISNUMBER(Terauda!G98),Terauda!C98,\"\")","v":""},{"$f":"IF(ISNUMBER(Terauda!G98),Terauda!E98,\"\")","v":""},{"$f":"IF(ISNUMBER(Terauda!G98),Terauda!G98,\"\")","v":""},{"$f":"IF(ISNUMBER(Terauda!G98),Terauda!H98,\"\")","v":""},{"$f":"IF(ISTEXT(Terauda!I98),Terauda!I98,\"\")","v":""},""]
[{"$f":"IF(ISNUMBER(Terauda!G99),Terauda!A99,\"\")","v":""},{"$f":"IF(ISNUMBER(Terauda!G99),Terauda!B99,\"\")","v":""},{"$f":"IF(ISNUMBER(Terauda!G99),Terauda!C99,\"\")","v":""},{"$f":"IF(ISNUMBER(Terauda!G99),Terauda!E99,\"\")","v":""},{"$f":"IF(ISNUMBER(Terauda!G99),Terauda!G99,\"\")","v":""},{"$f":"IF(ISNUMBER(Terauda!G99),Terauda!H99,\"\")","v":""},{"$f":"IF(ISTEXT(Terauda!I99),Terauda!I99,\"\")","v":""},""]
[{"$f":"IF(ISNUMBER(Terauda!G100),Terauda!A100,\"\")","v":""},{"$f":"IF(ISNUMBER(Terauda!G100),Terauda!B100,\"\")","v":""},{"$f":"IF(ISNUMBER(Terauda!G100),Terauda!C100,\"\")","v":""},{"$f":"IF(ISNUMBER(Terauda!G100),Terauda!E100,\"\")","v":""},{"$f":"IF(ISNUMBER(Terauda!G100),Terauda!G100,\"\")","v":""},{"$f":"IF(ISNUMBER(Terauda!G100),Terauda!H100,\"\")","v":""},{"$f":"IF(ISTEXT(Terauda!I100),Terauda!I100,\"\")","v":""},""]
[{"$f":"IF(ISNUMBER(Terauda!G101),Terauda!A101,\"\")","v":""},{"$f":"IF(ISNUMBER(Terauda!G101),Terauda!B101,\"\")","v":""},{"$f":"IF(ISNUMBER(Terauda!G101),Terauda!C101,\"\")","v":""},{"$f":"IF(ISNUMBER(Terauda!G101),Terauda!E101,\"\")","v":""},{"$f":"IF(ISNUMBER(Terauda!G101),Terauda!G101,\"\")","v":""},{"$f":"IF(ISNUMBER(Terauda!G101),Terauda!H101,\"\")","v":""},{"$f":"IF(ISTEXT(Terauda!I101),Terauda!I101,\"\")","v":""},""]
[{"$f":"IF(ISNUMBER(Terauda!G102),Terauda!A102,\"\")","v":""},{"$f":"IF(ISNUMBER(Terauda!G102),Terauda!B102,\"\")","v":""},{"$f":"IF(ISNUMBER(Terauda!G102),Terauda!C102,\"\")","v":""},{"$f":"IF(ISNUMBER(Terauda!G102),Terauda!E102,\"\")","v":""},{"$f":"IF(ISNUMBER(Terauda!G102),Terauda!G102,\"\")","v":""},{"$f":"IF(ISNUMBER(Terauda!G102),Terauda!H102,\"\")","v":""},{"$f":"IF(ISTEXT(Terauda!I102),Terauda!I102,\"\")","v":""},""]
[{"$f":"IF(ISNUMBER(Terauda!G103),Terauda!A103,\"\")","v":""},{"$f":"IF(ISNUMBER(Terauda!G103),Terauda!B103,\"\")","v":""},{"$f":"IF(ISNUMBER(Terauda!G103),Terauda!C103,\"\")","v":""},{"$f":"IF(ISNUMBER(Terauda!G103),Terauda!E103,\"\")","v":""},{"$f":"IF(ISNUMBER(Terauda!G103),Terauda!G103,\"\")","v":""},{"$f":"IF(ISNUMBER(Terauda!G103),Terauda!H103,\"\")","v":""},{"$f":"IF(ISTEXT(Terauda!I103),Terauda!I103,\"\")","v":""},""]
[{"$f":"IF(ISNUMBER(Terauda!G104),Terauda!A104,\"\")","v":""},{"$f":"IF(ISNUMBER(Terauda!G104),Terauda!B104,\"\")","v":""},{"$f":"IF(ISNUMBER(Terauda!G104),Terauda!C104,\"\")","v":""},{"$f":"IF(ISNUMBER(Terauda!G104),Terauda!E104,\"\")","v":""},{"$f":"IF(ISNUMBER(Terauda!G104),Terauda!G104,\"\")","v":""},{"$f":"IF(ISNUMBER(Terauda!G104),Terauda!H104,\"\")","v":""},{"$f":"IF(ISTEXT(Terauda!I104),Terauda!I104,\"\")","v":""},""]
[{"$f":"IF(ISNUMBER(Terauda!G105),Terauda!A105,\"\")","v":""},{"$f":"IF(ISNUMBER(Terauda!G105),Terauda!B105,\"\")","v":""},{"$f":"IF(ISNUMBER(Terauda!G105),Terauda!C105,\"\")","v":""},{"$f":"IF(ISNUMBER(Terauda!G105),Terauda!E105,\"\")","v":""},{"$f":"IF(ISNUMBER(Terauda!G105),Terauda!G105,\"\")","v":""},{"$f":"IF(ISNUMBER(Terauda!G105),Terauda!H105,\"\")","v":""},{"$f":"IF(ISTEXT(Terauda!I105),Terauda!I105,\"\")","v":""},""]
[{"$f":"IF(ISNUMBER(Terauda!G106),Terauda!A106,\"\")","v":""},{"$f":"IF(ISNUMBER(Terauda!G106),Terauda!B106,\"\")","v":""},{"$f":"IF(ISNUMBER(Terauda!G106),Terauda!C106,\"\")","v":""},{"$f":"IF(ISNUMBER(Terauda!G106),Terauda!E106,\"\")","v":""},{"$f":"IF(ISNUMBER(Terauda!G106),Terauda!G106,\"\")","v":""},{"$f":"IF(ISNUMBER(Terauda!G106),Terauda!H106,\"\")","v":""},{"$f":"IF(ISTEXT(Terauda!I106),Terauda!I106,\"\")","v":""},""]
[{"$f":"IF(ISNUMBER(Terauda!G107),Terauda!A107,\"\")","v":""},{"$f":"IF(ISNUMBER(Terauda!G107),Terauda!B107,\"\")","v":""},{"$f":"IF(ISNUMBER(Terauda!G107),Terauda!C107,\"\")","v":""},{"$f":"IF(ISNUMBER(Terauda!G107),Terauda!E107,\"\")","v":""},{"$f":"IF(ISNUMBER(Terauda!G107),Terauda!G107,\"\")","v":""},{"$f":"IF(ISNUMBER(Terauda!G107),Terauda!H107,\"\")","v":""},{"$f":"IF(ISTEXT(Terauda!I107),Terauda!I107,\"\")","v":""},""]
[{"$f":"IF(ISNUMBER(Terauda!G108),Terauda!A108,\"\")","v":""},{"$f":"IF(ISNUMBER(Terauda!G108),Terauda!B108,\"\")","v":""},{"$f":"IF(ISNUMBER(Terauda!G108),Terauda!C108,\"\")","v":""},{"$f":"IF(ISNUMBER(Terauda!G108),Terauda!E108,\"\")","v":""},{"$f":"IF(ISNUMBER(Terauda!G108),Terauda!G108,\"\")","v":""},{"$f":"IF(ISNUMBER(Terauda!G108),Terauda!H108,\"\")","v":""},{"$f":"IF(ISTEXT(Terauda!I108),Terauda!I108,\"\")","v":""},""]
[{"$f":"IF(ISNUMBER(Terauda!G109),Terauda!A109,\"\")","v":""},{"$f":"IF(ISNUMBER(Terauda!G109),Terauda!B109,\"\")","v":""},{"$f":"IF(ISNUMBER(Terauda!G109),Terauda!C109,\"\")","v":""},{"$f":"IF(ISNUMBER(Terauda!G109),Terauda!E109,\"\")","v":""},{"$f":"IF(ISNUMBER(Terauda!G109),Terauda!G109,\"\")","v":""},{"$f":"IF(ISNUMBER(Terauda!G109),Terauda!H109,\"\")","v":""},{"$f":"IF(ISTEXT(Terauda!I109),Terauda!I109,\"\")","v":""},""]
[{"$f":"IF(ISNUMBER(Terauda!G110),Terauda!A110,\"\")","v":""},{"$f":"IF(ISNUMBER(Terauda!G110),Terauda!B110,\"\")","v":""},{"$f":"IF(ISNUMBER(Terauda!G110),Terauda!C110,\"\")","v":""},{"$f":"IF(ISNUMBER(Terauda!G110),Terauda!E110,\"\")","v":""},{"$f":"IF(ISNUMBER(Terauda!G110),Terauda!G110,\"\")","v":""},{"$f":"IF(ISNUMBER(Terauda!G110),Terauda!H110,\"\")","v":""},{"$f":"IF(ISTEXT(Terauda!I110),Terauda!I110,\"\")","v":""},""]
[{"$f":"IF(ISNUMBER(Terauda!G111),Terauda!A111,\"\")","v":""},{"$f":"IF(ISNUMBER(Terauda!G111),Terauda!B111,\"\")","v":""},{"$f":"IF(ISNUMBER(Terauda!G111),Terauda!C111,\"\")","v":""},{"$f":"IF(ISNUMBER(Terauda!G111),Terauda!E111,\"\")","v":""},{"$f":"IF(ISNUMBER(Terauda!G111),Terauda!G111,\"\")","v":""},{"$f":"IF(ISNUMBER(Terauda!G111),Terauda!H111,\"\")","v":""},{"$f":"IF(ISTEXT(Terauda!I111),Terauda!I111,\"\")","v":""},""]
[{"$f":"IF(ISNUMBER(Terauda!G112),Terauda!A112,\"\")","v":""},{"$f":"IF(ISNUMBER(Terauda!G112),Terauda!B112,\"\")","v":""},{"$f":"IF(ISNUMBER(Terauda!G112),Terauda!C112,\"\")","v":""},{"$f":"IF(ISNUMBER(Terauda!G112),Terauda!E112,\"\")","v":""},{"$f":"IF(ISNUMBER(Terauda!G112),Terauda!G112,\"\")","v":""},{"$f":"IF(ISNUMBER(Terauda!G112),Terauda!H112,\"\")","v":""},{"$f":"IF(ISTEXT(Terauda!I112),Terauda!I112,\"\")","v":""},""]
[{"$f":"IF(ISNUMBER(Terauda!G113),Terauda!A113,\"\")","v":""},{"$f":"IF(ISNUMBER(Terauda!G113),Terauda!B113,\"\")","v":""},{"$f":"IF(ISNUMBER(Terauda!G113),Terauda!C113,\"\")","v":""},{"$f":"IF(ISNUMBER(Terauda!G113),Terauda!E113,\"\")","v":""},{"$f":"IF(ISNUMBER(Terauda!G113),Terauda!G113,\"\")","v":""},{"$f":"IF(ISNUMBER(Terauda!G113),Terauda!H113,\"\")","v":""},{"$f":"IF(ISTEXT(Terauda!I113),Terauda!I113,\"\")","v":""},""]
[{"$f":"IF(ISNUMBER(Terauda!G114),Terauda!A114,\"\")","v":""},{"$f":"IF(ISNUMBER(Terauda!G114),Terauda!B114,\"\")","v":""},{"$f":"IF(ISNUMBER(Terauda!G114),Terauda!C114,\"\")","v":""},{"$f":"IF(ISNUMBER(Terauda!G114),Terauda!E114,\"\")","v":""},{"$f":"IF(ISNUMBER(Terauda!G114),Terauda!G114,\"\")","v":""},{"$f":"IF(ISNUMBER(Terauda!G114),Terauda!H114,\"\")","v":""},{"$f":"IF(ISTEXT(Terauda!I114),Terauda!I114,\"\")","v":""},""]
[{"$f":"IF(ISNUMBER(Terauda!G115),Terauda!A115,\"\")","v":""},{"$f":"IF(ISNUMBER(Terauda!G115),Terauda!B115,\"\")","v":""},{"$f":"IF(ISNUMBER(Terauda!G115),Terauda!C115,\"\")","v":""},{"$f":"IF(ISNUMBER(Terauda!G115),Terauda!E115,\"\")","v":""},{"$f":"IF(ISNUMBER(Terauda!G115),Terauda!G115,\"\")","v":""},{"$f":"IF(ISNUMBER(Terauda!G115),Terauda!H115,\"\")","v":""},{"$f":"IF(ISTEXT(Terauda!I115),Terauda!I115,\"\")","v":""},""]
[{"$f":"IF(ISNUMBER(Terauda!G116),Terauda!A116,\"\")","v":""},{"$f":"IF(ISNUMBER(Terauda!G116),Terauda!B116,\"\")","v":""},{"$f":"IF(ISNUMBER(Terauda!G116),Terauda!C116,\"\")","v":""},{"$f":"IF(ISNUMBER(Terauda!G116),Terauda!E116,\"\")","v":""},{"$f":"IF(ISNUMBER(Terauda!G116),Terauda!G116,\"\")","v":""},{"$f":"IF(ISNUMBER(Terauda!G116),Terauda!H116,\"\")","v":""},{"$f":"IF(ISTEXT(Terauda!I116),Terauda!I116,\"\")","v":""},""]
[{"$f":"IF(ISNUMBER(Terauda!G117),Terauda!A117,\"\")","v":""},{"$f":"IF(ISNUMBER(Terauda!G117),Terauda!B117,\"\")","v":""},{"$f":"IF(ISNUMBER(Terauda!G117),Terauda!C117,\"\")","v":""},{"$f":"IF(ISNUMBER(Terauda!G117),Terauda!E117,\"\")","v":""},{"$f":"IF(ISNUMBER(Terauda!G117),Terauda!G117,\"\")","v":""},{"$f":"IF(ISNUMBER(Terauda!G117),Terauda!H117,\"\")","v":""},{"$f":"IF(ISTEXT(Terauda!I117),Terauda!I117,\"\")","v":""},""]
[{"$f":"IF(ISNUMBER(Terauda!G118),Terauda!A118,\"\")","v":""},{"$f":"IF(ISNUMBER(Terauda!G118),Terauda!B118,\"\")","v":""},{"$f":"IF(ISNUMBER(Terauda!G118),Terauda!C118,\"\")","v":""},{"$f":"IF(ISNUMBER(Terauda!G118),Terauda!E118,\"\")","v":""},{"$f":"IF(ISNUMBER(Terauda!G118),Terauda!G118,\"\")","v":""},{"$f":"IF(ISNUMBER(Terauda!G118),Terauda!H118,\"\")","v":""},{"$f":"IF(ISTEXT(Terauda!I118),Terauda!I118,\"\")","v":""},""]
[{"$f":"IF(ISNUMBER(Terauda!G119),Terauda!A119,\"\")","v":""},{"$f":"IF(ISNUMBER(Terauda!G119),Terauda!B119,\"\")","v":""},{"$f":"IF(ISNUMBER(Terauda!G119),Terauda!C119,\"\")","v":""},{"$f":"IF(ISNUMBER(Terauda!G119),Terauda!E119,\"\")","v":""},{"$f":"IF(ISNUMBER(Terauda!G119),Terauda!G119,\"\")","v":""},{"$f":"IF(ISNUMBER(Terauda!G119),Terauda!H119,\"\")","v":""},{"$f":"IF(ISTEXT(Terauda!I119),Terauda!I119,\"\")","v":""},""]
[{"$f":"IF(ISNUMBER(Terauda!G120),Terauda!A120,\"\")","v":""},{"$f":"IF(ISNUMBER(Terauda!G120),Terauda!B120,\"\")","v":""},{"$f":"IF(ISNUMBER(Terauda!G120),Terauda!C120,\"\")","v":""},{"$f":"IF(ISNUMBER(Terauda!G120),Terauda!E120,\"\")","v":""},{"$f":"IF(ISNUMBER(Terauda!G120),Terauda!G120,\"\")","v":""},{"$f":"IF(ISNUMBER(Terauda!G120),Terauda!H120,\"\")","v":""},{"$f":"IF(ISTEXT(Terauda!I120),Terauda!I120,\"\")","v":""},""]
[{"$f":"IF(ISNUMBER(Terauda!G121),Terauda!A121,\"\")","v":""},{"$f":"IF(ISNUMBER(Terauda!G121),Terauda!B121,\"\")","v":""},{"$f":"IF(ISNUMBER(Terauda!G121),Terauda!C121,\"\")","v":""},{"$f":"IF(ISNUMBER(Terauda!G121),Terauda!E121,\"\")","v":""},{"$f":"IF(ISNUMBER(Terauda!G121),Terauda!G121,\"\")","v":""},{"$f":"IF(ISNUMBER(Terauda!G121),Terauda!H121,\"\")","v":""},{"$f":"IF(ISTEXT(Terauda!I121),Terauda!I121,\"\")","v":""},""]
[{"$f":"IF(ISNUMBER(Terauda!G122),Terauda!A122,\"\")","v":""},{"$f":"IF(ISNUMBER(Terauda!G122),Terauda!B122,\"\")","v":""},{"$f":"IF(ISNUMBER(Terauda!G122),Terauda!C122,\"\")","v":""},{"$f":"IF(ISNUMBER(Terauda!G122),Terauda!E122,\"\")","v":""},{"$f":"IF(ISNUMBER(Terauda!G122),Terauda!G122,\"\")","v":""},{"$f":"IF(ISNUMBER(Terauda!G122),Terauda!H122,\"\")","v":""},{"$f":"IF(ISTEXT(Terauda!I122),Terauda!I122,\"\")","v":""},""]

{"sheet":"Makross","index":19,"n_rows":3,"n_cols":8,"rows_kept":3,"cut":false,"hidden":true,"merged":[]}
["Nr.p.k.","Nosaukums","Mērvienība","Cena par mērvienību (EUR)","Ievadiet daudzumu","Cena par daudzumu (EUR)","Piezīmes","Value"]
[null,null,null,null,null,null,null,"yes"]
["Nr.p.k.","Nosaukums","Mērvienība","Cena par mērvienību (EUR)","Ievadiet daudzumu","Cena par daudzumu (EUR)","Piezīmes","Value"]

{"sheet":"Koptāme","index":20,"n_rows":50,"n_cols":7,"rows_kept":50,"cut":false,"hidden":false,"merged":[[5,1,5,4],[6,1,6,4],[51,1,52,1]]}
[]
[]
[]
[]
[null,null,null,null,null,"EUR"]
[null,"Kopējās būvmateriālu tāmes izmaksas (bez PVN 21%)   ",null,null,null,{"$f":"IF(ISNUMBER(F11),SUM(F11:F50),\"\")","v":""}]
[null,"Kopējās būvmateriālu tāmes izmaksas (ar PVN 21% )   ",null,null,null,{"$f":"IF(ISNUMBER(F6),(F6+(F6*0.21)),\"\")","v":""}]
[]
["Nr.p.k.","Nosaukums","Mērvienība","Cena par mērvienību (EUR)","Ievadītais daudzums","Cena par daudzumu (EUR)","Piezīmes"]
[1,2,3,4,5,6,7]
[{"$f":"IF(ISNUMBER(E11),1,\"\")","v":""},{"$f":"IF(ISNUMBER(Makross!E4),Makross!B4,\"\")","v":""},{"$f":"IF(ISNUMBER(Makross!E4),Makross!C4,\"\")","v":""},{"$f":"IF(ISNUMBER(Makross!E4),Makross!D4,\"\")","v":""},{"$f":"IF(ISNUMBER(Makross!E4),Makross!E4,\"\")","v":""},{"$f":"IF(ISNUMBER(Makross!E4),Makross!F4,\"\")","v":""},{"$f":"IF(ISNUMBER(Makross!E4),Makross!G4,\"\")","v":""}]
[{"$f":"IF(ISNUMBER(E12),2,\"\")","v":""},{"$f":"IF(ISNUMBER(Makross!E5),Makross!B5,\"\")","v":""},{"$f":"IF(ISNUMBER(Makross!E5),Makross!C5,\"\")","v":""},{"$f":"IF(ISNUMBER(Makross!E5),Makross!D5,\"\")","v":""},{"$f":"IF(ISNUMBER(Makross!E5),Makross!E5,\"\")","v":""},{"$f":"IF(ISNUMBER(Makross!E5),Makross!F5,\"\")","v":""},{"$f":"IF(ISNUMBER(Makross!E5),Makross!G5,\"\")","v":""}]
[{"$f":"IF(ISNUMBER(E13),3,\"\")","v":""},{"$f":"IF(ISNUMBER(Makross!E6),Makross!B6,\"\")","v":""},{"$f":"IF(ISNUMBER(Makross!E6),Makross!C6,\"\")","v":""},{"$f":"IF(ISNUMBER(Makross!E6),Makross!D6,\"\")","v":""},{"$f":"IF(ISNUMBER(Makross!E6),Makross!E6,\"\")","v":""},{"$f":"IF(ISNUMBER(Makross!E6),Makross!F6,\"\")","v":""},{"$f":"IF(ISNUMBER(Makross!E6),Makross!G6,\"\")","v":""}]
[{"$f":"IF(ISNUMBER(E14),4,\"\")","v":""},{"$f":"IF(ISNUMBER(Makross!E7),Makross!B7,\"\")","v":""},{"$f":"IF(ISNUMBER(Makross!E7),Makross!C7,\"\")","v":""},{"$f":"IF(ISNUMBER(Makross!E7),Makross!D7,\"\")","v":""},{"$f":"IF(ISNUMBER(Makross!E7),Makross!E7,\"\")","v":""},{"$f":"IF(ISNUMBER(Makross!E7),Makross!F7,\"\")","v":""},{"$f":"IF(ISNUMBER(Makross!E7),Makross!G7,\"\")","v":""}]
[{"$f":"IF(ISNUMBER(E15),5,\"\")","v":""},{"$f":"IF(ISNUMBER(Makross!E8),Makross!B8,\"\")","v":""},{"$f":"IF(ISNUMBER(Makross!E8),Makross!C8,\"\")","v":""},{"$f":"IF(ISNUMBER(Makross!E8),Makross!D8,\"\")","v":""},{"$f":"IF(ISNUMBER(Makross!E8),Makross!E8,\"\")","v":""},{"$f":"IF(ISNUMBER(Makross!E8),Makross!F8,\"\")","v":""},{"$f":"IF(ISNUMBER(Makross!E8),Makross!G8,\"\")","v":""}]
[{"$f":"IF(ISNUMBER(E16),6,\"\")","v":""},{"$f":"IF(ISNUMBER(Makross!E9),Makross!B9,\"\")","v":""},{"$f":"IF(ISNUMBER(Makross!E9),Makross!C9,\"\")","v":""},{"$f":"IF(ISNUMBER(Makross!E9),Makross!D9,\"\")","v":""},{"$f":"IF(ISNUMBER(Makross!E9),Makross!E9,\"\")","v":""},{"$f":"IF(ISNUMBER(Makross!E9),Makross!F9,\"\")","v":""},{"$f":"IF(ISNUMBER(Makross!E9),Makross!G9,\"\")","v":""}]
[{"$f":"IF(ISNUMBER(E17),7,\"\")","v":""},{"$f":"IF(ISNUMBER(Makross!E10),Makross!B10,\"\")","v":""},{"$f":"IF(ISNUMBER(Makross!E10),Makross!C10,\"\")","v":""},{"$f":"IF(ISNUMBER(Makross!E10),Makross!D10,\"\")","v":""},{"$f":"IF(ISNUMBER(Makross!E10),Makross!E10,\"\")","v":""},{"$f":"IF(ISNUMBER(Makross!E10),Makross!F10,\"\")","v":""},{"$f":"IF(ISNUMBER(Makross!E10),Makross!G10,\"\")","v":""}]
[{"$f":"IF(ISNUMBER(E18),8,\"\")","v":""},{"$f":"IF(ISNUMBER(Makross!E11),Makross!B11,\"\")","v":""},{"$f":"IF(ISNUMBER(Makross!E11),Makross!C11,\"\")","v":""},{"$f":"IF(ISNUMBER(Makross!E11),Makross!D11,\"\")","v":""},{"$f":"IF(ISNUMBER(Makross!E11),Makross!E11,\"\")","v":""},{"$f":"IF(ISNUMBER(Makross!E11),Makross!F11,\"\")","v":""},{"$f":"IF(ISNUMBER(Makross!E11),Makross!G11,\"\")","v":""}]
[{"$f":"IF(ISNUMBER(E19),9,\"\")","v":""},{"$f":"IF(ISNUMBER(Makross!E12),Makross!B12,\"\")","v":""},{"$f":"IF(ISNUMBER(Makross!E12),Makross!C12,\"\")","v":""},{"$f":"IF(ISNUMBER(Makross!E12),Makross!D12,\"\")","v":""},{"$f":"IF(ISNUMBER(Makross!E12),Makross!E12,\"\")","v":""},{"$f":"IF(ISNUMBER(Makross!E12),Makross!F12,\"\")","v":""},{"$f":"IF(ISNUMBER(Makross!E12),Makross!G12,\"\")","v":""}]
[{"$f":"IF(ISNUMBER(E20),10,\"\")","v":""},{"$f":"IF(ISNUMBER(Makross!E13),Makross!B13,\"\")","v":""},{"$f":"IF(ISNUMBER(Makross!E13),Makross!C13,\"\")","v":""},{"$f":"IF(ISNUMBER(Makross!E13),Makross!D13,\"\")","v":""},{"$f":"IF(ISNUMBER(Makross!E13),Makross!E13,\"\")","v":""},{"$f":"IF(ISNUMBER(Makross!E13),Makross!F13,\"\")","v":""},{"$f":"IF(ISNUMBER(Makross!E13),Makross!G13,\"\")","v":""}]
[{"$f":"IF(ISNUMBER(E21),11,\"\")","v":""},{"$f":"IF(ISNUMBER(Makross!E14),Makross!B14,\"\")","v":""},{"$f":"IF(ISNUMBER(Makross!E14),Makross!C14,\"\")","v":""},{"$f":"IF(ISNUMBER(Makross!E14),Makross!D14,\"\")","v":""},{"$f":"IF(ISNUMBER(Makross!E14),Makross!E14,\"\")","v":""},{"$f":"IF(ISNUMBER(Makross!E14),Makross!F14,\"\")","v":""},{"$f":"IF(ISNUMBER(Makross!E14),Makross!G14,\"\")","v":""}]
[{"$f":"IF(ISNUMBER(E22),12,\"\")","v":""},{"$f":"IF(ISNUMBER(Makross!E15),Makross!B15,\"\")","v":""},{"$f":"IF(ISNUMBER(Makross!E15),Makross!C15,\"\")","v":""},{"$f":"IF(ISNUMBER(Makross!E15),Makross!D15,\"\")","v":""},{"$f":"IF(ISNUMBER(Makross!E15),Makross!E15,\"\")","v":""},{"$f":"IF(ISNUMBER(Makross!E15),Makross!F15,\"\")","v":""},{"$f":"IF(ISNUMBER(Makross!E15),Makross!G15,\"\")","v":""}]
[{"$f":"IF(ISNUMBER(E23),13,\"\")","v":""},{"$f":"IF(ISNUMBER(Makross!E16),Makross!B16,\"\")","v":""},{"$f":"IF(ISNUMBER(Makross!E16),Makross!C16,\"\")","v":""},{"$f":"IF(ISNUMBER(Makross!E16),Makross!D16,\"\")","v":""},{"$f":"IF(ISNUMBER(Makross!E16),Makross!E16,\"\")","v":""},{"$f":"IF(ISNUMBER(Makross!E16),Makross!F16,\"\")","v":""},{"$f":"IF(ISNUMBER(Makross!E16),Makross!G16,\"\")","v":""}]
[{"$f":"IF(ISNUMBER(E24),14,\"\")","v":""},{"$f":"IF(ISNUMBER(Makross!E17),Makross!B17,\"\")","v":""},{"$f":"IF(ISNUMBER(Makross!E17),Makross!C17,\"\")","v":""},{"$f":"IF(ISNUMBER(Makross!E17),Makross!D17,\"\")","v":""},{"$f":"IF(ISNUMBER(Makross!E17),Makross!E17,\"\")","v":""},{"$f":"IF(ISNUMBER(Makross!E17),Makross!F17,\"\")","v":""},{"$f":"IF(ISNUMBER(Makross!E17),Makross!G17,\"\")","v":""}]
[{"$f":"IF(ISNUMBER(E25),15,\"\")","v":""},{"$f":"IF(ISNUMBER(Makross!E18),Makross!B18,\"\")","v":""},{"$f":"IF(ISNUMBER(Makross!E18),Makross!C18,\"\")","v":""},{"$f":"IF(ISNUMBER(Makross!E18),Makross!D18,\"\")","v":""},{"$f":"IF(ISNUMBER(Makross!E18),Makross!E18,\"\")","v":""},{"$f":"IF(ISNUMBER(Makross!E18),Makross!F18,\"\")","v":""},{"$f":"IF(ISNUMBER(Makross!E18),Makross!G18,\"\")","v":""}]
[{"$f":"IF(ISNUMBER(E26),16,\"\")","v":""},{"$f":"IF(ISNUMBER(Makross!E19),Makross!B19,\"\")","v":""},{"$f":"IF(ISNUMBER(Makross!E19),Makross!C19,\"\")","v":""},{"$f":"IF(ISNUMBER(Makross!E19),Makross!D19,\"\")","v":""},{"$f":"IF(ISNUMBER(Makross!E19),Makross!E19,\"\")","v":""},{"$f":"IF(ISNUMBER(Makross!E19),Makross!F19,\"\")","v":""},{"$f":"IF(ISNUMBER(Makross!E19),Makross!G19,\"\")","v":""}]
[{"$f":"IF(ISNUMBER(E27),17,\"\")","v":""},{"$f":"IF(ISNUMBER(Makross!E20),Makross!B20,\"\")","v":""},{"$f":"IF(ISNUMBER(Makross!E20),Makross!C20,\"\")","v":""},{"$f":"IF(ISNUMBER(Makross!E20),Makross!D20,\"\")","v":""},{"$f":"IF(ISNUMBER(Makross!E20),Makross!E20,\"\")","v":""},{"$f":"IF(ISNUMBER(Makross!E20),Makross!F20,\"\")","v":""},{"$f":"IF(ISNUMBER(Makross!E20),Makross!G20,\"\")","v":""}]
[{"$f":"IF(ISNUMBER(E28),18,\"\")","v":""},{"$f":"IF(ISNUMBER(Makross!E21),Makross!B21,\"\")","v":""},{"$f":"IF(ISNUMBER(Makross!E21),Makross!C21,\"\")","v":""},{"$f":"IF(ISNUMBER(Makross!E21),Makross!D21,\"\")","v":""},{"$f":"IF(ISNUMBER(Makross!E21),Makross!E21,\"\")","v":""},{"$f":"IF(ISNUMBER(Makross!E21),Makross!F21,\"\")","v":""},{"$f":"IF(ISNUMBER(Makross!E21),Makross!G21,\"\")","v":""}]
[{"$f":"IF(ISNUMBER(E29),19,\"\")","v":""},{"$f":"IF(ISNUMBER(Makross!E22),Makross!B22,\"\")","v":""},{"$f":"IF(ISNUMBER(Makross!E22),Makross!C22,\"\")","v":""},{"$f":"IF(ISNUMBER(Makross!E22),Makross!D22,\"\")","v":""},{"$f":"IF(ISNUMBER(Makross!E22),Makross!E22,\"\")","v":""},{"$f":"IF(ISNUMBER(Makross!E22),Makross!F22,\"\")","v":""},{"$f":"IF(ISNUMBER(Makross!E22),Makross!G22,\"\")","v":""}]
[{"$f":"IF(ISNUMBER(E30),20,\"\")","v":""},{"$f":"IF(ISNUMBER(Makross!E23),Makross!B23,\"\")","v":""},{"$f":"IF(ISNUMBER(Makross!E23),Makross!C23,\"\")","v":""},{"$f":"IF(ISNUMBER(Makross!E23),Makross!D23,\"\")","v":""},{"$f":"IF(ISNUMBER(Makross!E23),Makross!E23,\"\")","v":""},{"$f":"IF(ISNUMBER(Makross!E23),Makross!F23,\"\")","v":""},{"$f":"IF(ISNUMBER(Makross!E23),Makross!G23,\"\")","v":""}]
[{"$f":"IF(ISNUMBER(E31),21,\"\")","v":""},{"$f":"IF(ISNUMBER(Makross!E24),Makross!B24,\"\")","v":""},{"$f":"IF(ISNUMBER(Makross!E24),Makross!C24,\"\")","v":""},{"$f":"IF(ISNUMBER(Makross!E24),Makross!D24,\"\")","v":""},{"$f":"IF(ISNUMBER(Makross!E24),Makross!E24,\"\")","v":""},{"$f":"IF(ISNUMBER(Makross!E24),Makross!F24,\"\")","v":""},{"$f":"IF(ISNUMBER(Makross!E24),Makross!G24,\"\")","v":""}]
[{"$f":"IF(ISNUMBER(E32),22,\"\")","v":""},{"$f":"IF(ISNUMBER(Makross!E25),Makross!B25,\"\")","v":""},{"$f":"IF(ISNUMBER(Makross!E25),Makross!C25,\"\")","v":""},{"$f":"IF(ISNUMBER(Makross!E25),Makross!D25,\"\")","v":""},{"$f":"IF(ISNUMBER(Makross!E25),Makross!E25,\"\")","v":""},{"$f":"IF(ISNUMBER(Makross!E25),Makross!F25,\"\")","v":""},{"$f":"IF(ISNUMBER(Makross!E25),Makross!G25,\"\")","v":""}]
[{"$f":"IF(ISNUMBER(E33),23,\"\")","v":""},{"$f":"IF(ISNUMBER(Makross!E26),Makross!B26,\"\")","v":""},{"$f":"IF(ISNUMBER(Makross!E26),Makross!C26,\"\")","v":""},{"$f":"IF(ISNUMBER(Makross!E26),Makross!D26,\"\")","v":""},{"$f":"IF(ISNUMBER(Makross!E26),Makross!E26,\"\")","v":""},{"$f":"IF(ISNUMBER(Makross!E26),Makross!F26,\"\")","v":""},{"$f":"IF(ISNUMBER(Makross!E26),Makross!G26,\"\")","v":""}]
[{"$f":"IF(ISNUMBER(E34),24,\"\")","v":""},{"$f":"IF(ISNUMBER(Makross!E27),Makross!B27,\"\")","v":""},{"$f":"IF(ISNUMBER(Makross!E27),Makross!C27,\"\")","v":""},{"$f":"IF(ISNUMBER(Makross!E27),Makross!D27,\"\")","v":""},{"$f":"IF(ISNUMBER(Makross!E27),Makross!E27,\"\")","v":""},{"$f":"IF(ISNUMBER(Makross!E27),Makross!F27,\"\")","v":""},{"$f":"IF(ISNUMBER(Makross!E27),Makross!G27,\"\")","v":""}]
[{"$f":"IF(ISNUMBER(E35),25,\"\")","v":""},{"$f":"IF(ISNUMBER(Makross!E28),Makross!B28,\"\")","v":""},{"$f":"IF(ISNUMBER(Makross!E28),Makross!C28,\"\")","v":""},{"$f":"IF(ISNUMBER(Makross!E28),Makross!D28,\"\")","v":""},{"$f":"IF(ISNUMBER(Makross!E28),Makross!E28,\"\")","v":""},{"$f":"IF(ISNUMBER(Makross!E28),Makross!F28,\"\")","v":""},{"$f":"IF(ISNUMBER(Makross!E28),Makross!G28,\"\")","v":""}]
[{"$f":"IF(ISNUMBER(E36),26,\"\")","v":""},{"$f":"IF(ISNUMBER(Makross!E29),Makross!B29,\"\")","v":""},{"$f":"IF(ISNUMBER(Makross!E29),Makross!C29,\"\")","v":""},{"$f":"IF(ISNUMBER(Makross!E29),Makross!D29,\"\")","v":""},{"$f":"IF(ISNUMBER(Makross!E29),Makross!E29,\"\")","v":""},{"$f":"IF(ISNUMBER(Makross!E29),Makross!F29,\"\")","v":""},{"$f":"IF(ISNUMBER(Makross!E29),Makross!G29,\"\")","v":""}]
[{"$f":"IF(ISNUMBER(E37),27,\"\")","v":""},{"$f":"IF(ISNUMBER(Makross!E30),Makross!B30,\"\")","v":""},{"$f":"IF(ISNUMBER(Makross!E30),Makross!C30,\"\")","v":""},{"$f":"IF(ISNUMBER(Makross!E30),Makross!D30,\"\")","v":""},{"$f":"IF(ISNUMBER(Makross!E30),Makross!E30,\"\")","v":""},{"$f":"IF(ISNUMBER(Makross!E30),Makross!F30,\"\")","v":""},{"$f":"IF(ISNUMBER(Makross!E30),Makross!G30,\"\")","v":""}]
[{"$f":"IF(ISNUMBER(E38),28,\"\")","v":""},{"$f":"IF(ISNUMBER(Makross!E31),Makross!B31,\"\")","v":""},{"$f":"IF(ISNUMBER(Makross!E31),Makross!C31,\"\")","v":""},{"$f":"IF(ISNUMBER(Makross!E31),Makross!D31,\"\")","v":""},{"$f":"IF(ISNUMBER(Makross!E31),Makross!E31,\"\")","v":""},{"$f":"IF(ISNUMBER(Makross!E31),Makross!F31,\"\")","v":""},{"$f":"IF(ISNUMBER(Makross!E31),Makross!G31,\"\")","v":""}]
[{"$f":"IF(ISNUMBER(E39),29,\"\")","v":""},{"$f":"IF(ISNUMBER(Makross!E32),Makross!B32,\"\")","v":""},{"$f":"IF(ISNUMBER(Makross!E32),Makross!C32,\"\")","v":""},{"$f":"IF(ISNUMBER(Makross!E32),Makross!D32,\"\")","v":""},{"$f":"IF(ISNUMBER(Makross!E32),Makross!E32,\"\")","v":""},{"$f":"IF(ISNUMBER(Makross!E32),Makross!F32,\"\")","v":""},{"$f":"IF(ISNUMBER(Makross!E32),Makross!G32,\"\")","v":""}]
[{"$f":"IF(ISNUMBER(E40),30,\"\")","v":""},{"$f":"IF(ISNUMBER(Makross!E33),Makross!B33,\"\")","v":""},{"$f":"IF(ISNUMBER(Makross!E33),Makross!C33,\"\")","v":""},{"$f":"IF(ISNUMBER(Makross!E33),Makross!D33,\"\")","v":""},{"$f":"IF(ISNUMBER(Makross!E33),Makross!E33,\"\")","v":""},{"$f":"IF(ISNUMBER(Makross!E33),Makross!F33,\"\")","v":""},{"$f":"IF(ISNUMBER(Makross!E33),Makross!G33,\"\")","v":""}]
[{"$f":"IF(ISNUMBER(E41),31,\"\")","v":""},{"$f":"IF(ISNUMBER(Makross!E34),Makross!B34,\"\")","v":""},{"$f":"IF(ISNUMBER(Makross!E34),Makross!C34,\"\")","v":""},{"$f":"IF(ISNUMBER(Makross!E34),Makross!D34,\"\")","v":""},{"$f":"IF(ISNUMBER(Makross!E34),Makross!E34,\"\")","v":""},{"$f":"IF(ISNUMBER(Makross!E34),Makross!F34,\"\")","v":""},{"$f":"IF(ISNUMBER(Makross!E34),Makross!G34,\"\")","v":""}]
[{"$f":"IF(ISNUMBER(E42),32,\"\")","v":""},{"$f":"IF(ISNUMBER(Makross!E35),Makross!B35,\"\")","v":""},{"$f":"IF(ISNUMBER(Makross!E35),Makross!C35,\"\")","v":""},{"$f":"IF(ISNUMBER(Makross!E35),Makross!D35,\"\")","v":""},{"$f":"IF(ISNUMBER(Makross!E35),Makross!E35,\"\")","v":""},{"$f":"IF(ISNUMBER(Makross!E35),Makross!F35,\"\")","v":""},{"$f":"IF(ISNUMBER(Makross!E35),Makross!G35,\"\")","v":""}]
[{"$f":"IF(ISNUMBER(E43),33,\"\")","v":""},{"$f":"IF(ISNUMBER(Makross!E36),Makross!B36,\"\")","v":""},{"$f":"IF(ISNUMBER(Makross!E36),Makross!C36,\"\")","v":""},{"$f":"IF(ISNUMBER(Makross!E36),Makross!D36,\"\")","v":""},{"$f":"IF(ISNUMBER(Makross!E36),Makross!E36,\"\")","v":""},{"$f":"IF(ISNUMBER(Makross!E36),Makross!F36,\"\")","v":""},{"$f":"IF(ISNUMBER(Makross!E36),Makross!G36,\"\")","v":""}]
[{"$f":"IF(ISNUMBER(E44),34,\"\")","v":""},{"$f":"IF(ISNUMBER(Makross!E37),Makross!B37,\"\")","v":""},{"$f":"IF(ISNUMBER(Makross!E37),Makross!C37,\"\")","v":""},{"$f":"IF(ISNUMBER(Makross!E37),Makross!D37,\"\")","v":""},{"$f":"IF(ISNUMBER(Makross!E37),Makross!E37,\"\")","v":""},{"$f":"IF(ISNUMBER(Makross!E37),Makross!F37,\"\")","v":""},{"$f":"IF(ISNUMBER(Makross!E37),Makross!G37,\"\")","v":""}]
[{"$f":"IF(ISNUMBER(E45),35,\"\")","v":""},{"$f":"IF(ISNUMBER(Makross!E38),Makross!B38,\"\")","v":""},{"$f":"IF(ISNUMBER(Makross!E38),Makross!C38,\"\")","v":""},{"$f":"IF(ISNUMBER(Makross!E38),Makross!D38,\"\")","v":""},{"$f":"IF(ISNUMBER(Makross!E38),Makross!E38,\"\")","v":""},{"$f":"IF(ISNUMBER(Makross!E38),Makross!F38,\"\")","v":""},{"$f":"IF(ISNUMBER(Makross!E38),Makross!G38,\"\")","v":""}]
[{"$f":"IF(ISNUMBER(E46),36,\"\")","v":""},{"$f":"IF(ISNUMBER(Makross!E39),Makross!B39,\"\")","v":""},{"$f":"IF(ISNUMBER(Makross!E39),Makross!C39,\"\")","v":""},{"$f":"IF(ISNUMBER(Makross!E39),Makross!D39,\"\")","v":""},{"$f":"IF(ISNUMBER(Makross!E39),Makross!E39,\"\")","v":""},{"$f":"IF(ISNUMBER(Makross!E39),Makross!F39,\"\")","v":""},{"$f":"IF(ISNUMBER(Makross!E39),Makross!G39,\"\")","v":""}]
[{"$f":"IF(ISNUMBER(E47),37,\"\")","v":""},{"$f":"IF(ISNUMBER(Makross!E40),Makross!B40,\"\")","v":""},{"$f":"IF(ISNUMBER(Makross!E40),Makross!C40,\"\")","v":""},{"$f":"IF(ISNUMBER(Makross!E40),Makross!D40,\"\")","v":""},{"$f":"IF(ISNUMBER(Makross!E40),Makross!E40,\"\")","v":""},{"$f":"IF(ISNUMBER(Makross!E40),Makross!F40,\"\")","v":""},{"$f":"IF(ISNUMBER(Makross!E40),Makross!G40,\"\")","v":""}]
[{"$f":"IF(ISNUMBER(E48),38,\"\")","v":""},{"$f":"IF(ISNUMBER(Makross!E41),Makross!B41,\"\")","v":""},{"$f":"IF(ISNUMBER(Makross!E41),Makross!C41,\"\")","v":""},{"$f":"IF(ISNUMBER(Makross!E41),Makross!D41,\"\")","v":""},{"$f":"IF(ISNUMBER(Makross!E41),Makross!E41,\"\")","v":""},{"$f":"IF(ISNUMBER(Makross!E41),Makross!F41,\"\")","v":""},{"$f":"IF(ISNUMBER(Makross!E41),Makross!G41,\"\")","v":""}]
[{"$f":"IF(ISNUMBER(E49),39,\"\")","v":""},{"$f":"IF(ISNUMBER(Makross!E42),Makross!B42,\"\")","v":""},{"$f":"IF(ISNUMBER(Makross!E42),Makross!C42,\"\")","v":""},{"$f":"IF(ISNUMBER(Makross!E42),Makross!D42,\"\")","v":""},{"$f":"IF(ISNUMBER(Makross!E42),Makross!E42,\"\")","v":""},{"$f":"IF(ISNUMBER(Makross!E42),Makross!F42,\"\")","v":""},{"$f":"IF(ISNUMBER(Makross!E42),Makross!G42,\"\")","v":""}]
[{"$f":"IF(ISNUMBER(E50),0,\"\")","v":""},{"$f":"IF(ISNUMBER(Makross!E43),Makross!B43,\"\")","v":""},{"$f":"IF(ISNUMBER(Makross!E43),Makross!C43,\"\")","v":""},{"$f":"IF(ISNUMBER(Makross!E43),Makross!D43,\"\")","v":""},{"$f":"IF(ISNUMBER(Makross!E43),Makross!E43,\"\")","v":""},{"$f":"IF(ISNUMBER(Makross!E43),Makross!F43,\"\")","v":""},{"$f":"IF(ISNUMBER(Makross!E43),Makross!G43,\"\")","v":""}]